{"text_format":"1","workbook":"xlsx","n_sheets":15,"sheets":["Instructions","Project Info","Savings Summary","EPE PAF","Refrigeration","Food Service & DHW","HVAC & Envelope","Motors","Misc","DSMT Export","Measure_Line_Item__c","Lookup tables","County to Zone","Utility Admin","Version Log"],"not_rendered":{"charts":0,"images":9,"macros":1,"external_links":0,"defined_names":156,"comments":0,"pivot_tables":0},"unopened":[],"bounds":{"document_bytes":16777216,"sheet_cells":100000,"rows_first":2000,"rows_last":500,"rows_between":2000,"halvings":0,"cell_chars":16384,"cell_head_chars":4096},"cells_cut":0,"cells_raw":0,"read":"whole","date_system":"1900"}

{"sheet":"Instructions","index":0,"n_rows":37,"n_cols":2,"rows_kept":37,"cut":false,"hidden":true,"merged":[[26,1,27,12],[36,0,38,13],[1,0,2,12]]}
["Instructions"]
["This sheet provides basic instructions for using this calculator. Please contact the utility rebate program staff for further help or questions."]
[]
[]
["Getting Started"]
[]
[null,"After opening the file, enable macros if prompted. This tool uses macros to format the spreadsheets for different scenarios."]
[]
[]
[]
[]
[]
[]
[]
[]
[]
[]
[]
[]
[]
[]
[]
[]
["Project Info"]
[]
[]
["1.","Start with this sheet. Enter in all relevant information for the project. The minimum required fields are State, Utility, County, and Program; these fields have drop-downs."]
[]
["2.","Once the required information is filled in, use the macro buttons to the side to open up tabs for specific measure types."]
[]
["Measure Tabs"]
["The \"Refrigeration\" and \"Food Service\" tabs feature multiple measures. Click on the individual measure headings to expand them and show the inputs."]
[]
["-","For all measures, follow the heading prompts and fill in all columns to calculate savings. Several columns use drop-downs."]
[]
["Savings Summary"]
["This tab shows the summary of savings for all energy conservation measures included in the project. This tab also shows the estimated incentives for each measure and for the total project. Some programs cap incentive based on project cost, this tab will also check for that if project cost has been entered."]

{"sheet":"Project Info","index":1,"n_rows":20,"n_cols":13,"rows_kept":20,"cut":false,"hidden":false,"merged":[[17,3,17,4],[19,3,19,10],[12,3,12,5],[12,9,12,10],[3,3,3,10],[4,3,4,10],[5,3,5,10],[6,3,6,10],[8,3,8,4],[8,8,8,9],[9,3,9,4],[9,8,9,9],[10,3,10,10],[11,3,11,4],[11,8,11,10],[1,1,1,6],[0,12,0,15],[13,3,13,10],[14,3,14,8],[16,3,16,4]]}
[null,"Texas \"Other Measures\" Calculator",null,null,null,null,null,null,null,null,"v23.0"]
[null,"A calculation tool for determining deemed savings for projects other than standard prescriptive lighting & HVAC replacements."]
[null,null,null,null,null,{"$f":"IF(OR(D9=\"\",D10=\"\",I9=\"\",I10=\"\"),\"Please fill in highlighted cells to continue.\",\"\")","v":""},null,null,null,null,null,null,"Click buttons to open or close measure groups"]
[null,null,"Assessed by:"]
[null,null,"Project ID:"]
[null,null,"Project Name:"]
[null,null,"Project Sponsor:"]
[]
[null,null,"State:","TX",null,null,null,"Utility:","AEP TCD"]
[null,null,{"$f":"IFERROR(IF('Project Info'!D9=\"LA\",\"Parish:\",\"County:\"),\"\")","v":"County:"},"Aransas",null,null,null,"Program:","Commercial Solutions"]
[null,null,"Contact Name:"]
[null,null,"Contact Phone:",null,null,null,null,"Contact Email:"]
[null,null,"Account Number:",null,null,null,null,null,"Name on Account:"]
[null,null,"Project Site Address:"]
[null,null,"City:",null,null,null,null,null,null,"ZIP Code:"]
[]
[null,null,"Incentive Paid to:",null,null,null,null,null,"$/kWh","$/kW"]
[null,null,"Project Cost:",null,null,null,null,"Utility Rates:",0.1,0]
[]
[null,null,"Project Decription:"]

{"sheet":"Savings Summary","index":2,"n_rows":56,"n_cols":121,"rows_kept":56,"cut":false,"hidden":false,"merged":[[55,7,57,9],[6,1,6,2],[7,1,17,1],[41,1,45,1],[32,1,40,1],[18,1,31,1],[46,1,50,1]]}
[null,"Savings Summary",null,null,null,null,null,null,null,null,"HIDE","HIDE","HIDE","HIDE","HIDE","HIDE","HIDE","HIDE","HIDE","HIDE","HIDE","HIDE","HIDE","HIDE","HIDE","HIDE","HIDE","HIDE","HIDE","HIDE","HIDE","HIDE","HIDE","HIDE","HIDE","HIDE","HIDE","HIDE","HIDE","HIDE","HIDE","HIDE","HIDE","HIDE","HIDE","HIDE","HIDE","HIDE","HIDE","HIDE","HIDE","HIDE","HIDE","HIDE","HIDE","HIDE","HIDE","HIDE","HIDE","HIDE","HIDE","HIDE","HIDE","HIDE","HIDE","HIDE","HIDE","HIDE","HIDE","HIDE","HIDE","HIDE","HIDE","HIDE","HIDE","HIDE","HIDE","HIDE","HIDE","HIDE","HIDE","HIDE","HIDE","HIDE","HIDE","HIDE","HIDE","HIDE","HIDE","HIDE","HIDE","HIDE","HIDE","HIDE","HIDE","HIDE","HIDE","HIDE","HIDE","HIDE","HIDE","HIDE","HIDE","HIDE","HIDE","HIDE","HIDE","HIDE","HIDE","HIDE","HIDE","HIDE","HIDE","HIDE","HIDE","HIDE","HIDE","HIDE","HIDE","HIDE","HIDE"]
[null,null,"Project Name:",{"$f":"IF('Project Info'!D6:K6=\"\",\"\",'Project Info'!D6:K6)","v":""}]
[]
[null,null,null,null,"Total Summer Peak kW Savings","Total Winter Peak kW Savings","Total Non-Coincident kW Savings","Total kWh Savings","Total Incentive*","Total Project Cost","Non-Capped Incentive",null,null,null,null,null,null,null,"Incentive Matrix"]
[null,null,null,null,{"$f":"SUM(E8:E48)","v":0},{"$f":"SUM(F8:F48)","v":0},{"$f":"SUM(G8:G48)","v":0},{"$f":"SUM(H8:H48)","v":0},{"$f":"IF(I53=\"Yes\",'Utility Admin'!G2,K5)","v":0},{"$f":"IF('Project Info'!D18=\"\",\"Not Entered\",'Project Info'!D18)","v":"Not Entered"},{"$f":"SUM(K8:K48)","v":0}]
[null,null,null,null,null,null,null,null,null,null,null,null,null,null,null,null,null,null,"AEP SWEPCOCommercial Solutions",null,null,null,null,null,"AEP SWEPCOSCORE",null,null,null,null,null,"AEP TCDCommercial Solutions",null,null,null,null,null,"AEP TCDSCORE/CitySmart",null,null,null,null,null,"AEP TNDCommercial Solutions",null,null,null,null,null,"AEP TNDSCORE/CitySmart",null,null,null,null,null,"CenterPoint EnergySCORE/CitySmart",null,null,null,null,null,"CPS EnergyLarge C&I",null,null,null,null,null,"CPS EnergySchools & Inst",null,null,null,null,null,"CPS EnergySmall Business",null,null,null,null,null,"El Paso Electric TXLarge Commercial Solutions",null,null,null,null,null,"El Paso Electric TXSCORE",null,null,null,null,null,"El Paso Electric TXSmall Commercial Solutions",null,null,null,null,null,"Entergy TXCommercial Solutions",null,null,null,null,null,"Texas-New Mexico PowerCommercial Solutions",null,null,null,null,null,"Texas-New Mexico PowerSCORE/CitySmart",null,null,null,null,null,"Texas-New Mexico PowerSCORE Underserved/Small Score"]
[null,"Measure Category",null,"EUL","Summer Peak kW Savings","Winter Peak kW Savings","Non-Coincident kW Savings","kWh Savings","Incentive*","Estimated Measure Cost","Non-Capped Incentive","kWh Savings","Load Factor Cap","$/kW","$/NCPkW","$/kWh","Eligible Measure","Record Type ID","$/kW","$/kWh","PROD Eligible Measure","PROD Record Type ID","UAT Eligible Measure","UAT Record Type ID","$/kW","$/kWh","PROD Eligible Measure","PROD Record Type ID","UAT Eligible Measure","UAT Record Type ID","$/kW","$/kWh","PROD Eligible Measure","PROD Record Type ID","UAT Eligible Measure","UAT Record Type ID","$/kW","$/kWh","PROD Eligible Measure","PROD Record Type ID","UAT Eligible Measure","UAT Record Type ID","$/kW","$/kWh","PROD Eligible Measure","PROD Record Type ID","UAT Eligible Measure","UAT Record Type ID","$/kW","$/kWh","PROD Eligible Measure","PROD Record Type ID","UAT Eligible Measure","UAT Record Type ID","$/kW","$/kWh","PROD Eligible Measure","PROD Record Type ID","UAT Eligible Measure","UAT Record Type ID","$/NCPkW","$/kWh","PROD Eligible Measure","PROD Record Type ID","UAT Eligible Measure","UAT Record Type ID","$/NCPkW","$/kWh","PROD Eligible Measure","PROD Record Type ID","UAT Eligible Measure","UAT Record Type ID","$/NCPkW","$/kWh","PROD Eligible Measure","PROD Record Type ID","UAT Eligible Measure","UAT Record Type ID","$/kW","$/kWh","PROD Eligible Measure","PROD Record Type ID","UAT Eligible Measure","UAT Record Type ID","$/kW","$/kWh","PROD Eligible Measure","PROD Record Type ID","UAT Eligible Measure","UAT Record Type ID","$/kW","$/kWh","PROD Eligible Measure","PROD Record Type ID","UAT Eligible Measure","UAT Record Type ID","$/kW","$/kWh","PROD Eligible Measure","PROD Record Type ID","UAT Eligible Measure","UAT Record Type ID","$/kW","$/kWh","PROD Eligible Measure","PROD Record Type ID","UAT Eligible Measure","UAT Record Type ID","$/kW","$/kWh","PROD Eligible Measure","PROD Record Type ID","UAT Eligible Measure","UAT Record Type ID","$/kW","$/kWh","PROD Eligible Measure","PROD Record Type ID","UAT Eligible Measure","UAT Record Type ID","Names for EPE measure list"]
[null,"Refrigeration","Door Gaskets",3,{"$f":"ROUND(Refrigeration!B10,3)","v":0},0,{"$f":"MAX(ROUND(Refrigeration!C10,3),E8:F8)","v":0},{"$f":"ROUND(MIN(L8:M8),0)","v":0},{"$f":"IF(I$53=\"Yes\",L8/H$5*I$5,K8)","v":0},{"$f":"IF(OR(J$5=\"Not Entered\",$H$5=0),0,H8/$H$5*$J$5)","v":0},{"$f":"IFERROR(G8*O8+(E8+F8)*N8+H8*P8,0)","v":0},{"$f":"Refrigeration!D10","v":0},{"$f":"IFERROR(MAX(E8:F8)*LoadFactor,L8)","v":0},{"$f":"IF(Utility=\"CPS Energy\",0,INDEX($S8:$DL8,1,MATCH(Utility&Program,'Savings Summary'!$S$6:$DL$6,0)))","v":150},{"$f":"IF(Utility=\"CPS Energy\",INDEX($S8:$DL8,1,MATCH(Utility&Program,'Savings Summary'!$S$6:$DL$6,0)),0)","v":0},{"$f":"INDEX($S8:$DL8,1,MATCH(Utility&Program,'Savings Summary'!$S$6:$DL$6,0)+1)","v":0},{"$f":"INDEX(S8:DP8,1,MATCH(Utility&Program,$S$6:$DP$6,0)+IF(DSMTEnvironment = \"UAT\",4,2))","v":"a1r3u000003Fil7AAC"},{"$f":"INDEX(S8:DP8,1,MATCH(Utility&Program,$S$6:$DP$6,0)+IF(DSMTEnvironment=\"UAT\",5,3))","v":"0123u000000VQdAAAW"},250,0,null,null,null,null,250,0,null,null,null,null,150,0,"a1r3u000003Fil7AAC","0123u000000VQdAAAW","a1r790000008VLFAA2","012790000004MSZAA2",150,0,"a1r3u000003FijgAAC","0123u000000VQdAAAW","a1r790000008VpYAAU","012790000004MSZAA2",0,0.05,"a1r3u000007a59bAAA","0123u000000VQdAAAW","a1r79000000AIbp","012790000004MSZAA2",0,0.05,"a1r3u000007deR9AAI","0123u000000VQdAAAW","a1r79000000AIxxAAG","012790000004MSZAA2",220,0.06,null,null,"a1r79000000AJp6AAG","012790000004MSZAA2",200,0.03,"a1r3u0000069BuaAAE","0123u000000aP5cAAE","a1r79000000A5lM","012790000004PuSAAU",200,0.03,"a1r3u0000069DAfAAM","0123u000000aP5cAAE","a1r79000000A6V2AAK","012790000004PuSAAU",550,0,null,null,null,null,240,0,null,null,null,null,240,0,null,null,null,null,400,0,null,null,null,null,275,0.02,null,null,null,null,150,0.03,null,null,null,null,150,0.03,null,null,null,null,250,0.03,null,null,null,null,{"$f":"IF(H8<>0,C8&\", \",\"\")","v":""}]
[null,null,"Door Heater Controls for Refrigerated Display Cases ",12,{"$f":"ROUND(Refrigeration!B16,3)","v":0},0,{"$f":"MAX(ROUND(Refrigeration!C16,3),E9:F9)","v":0},{"$f":"ROUND(MIN(L9:M9),0)","v":0},0,{"$f":"IF(OR(J$5=\"Not Entered\",$H$5=0),0,H9/$H$5*$J$5)","v":0},{"$f":"IFERROR(G9*O9+(E9+F9)*N9+H9*P9,0)","v":0},{"$f":"Refrigeration!D16","v":0},{"$f":"IFERROR(MAX(E9:F9)*LoadFactor,L9)","v":0},{"$f":"IF(Utility=\"CPS Energy\",0,INDEX($S9:$DL9,1,MATCH(Utility&Program,'Savings Summary'!$S$6:$DL$6,0)))","v":150},{"$f":"IF(Utility=\"CPS Energy\",INDEX($S9:$DL9,1,MATCH(Utility&Program,'Savings Summary'!$S$6:$DL$6,0)),0)","v":0},{"$f":"INDEX($S9:$DL9,1,MATCH(Utility&Program,'Savings Summary'!$S$6:$DL$6,0)+1)","v":0},{"$f":"INDEX(S9:DP9,1,MATCH(Utility&Program,$S$6:$DP$6,0)+IF(DSMTEnvironment = \"UAT\",4,2))","v":"a1r3u000003Fil9AAC"},{"$f":"INDEX(S9:DP9,1,MATCH(Utility&Program,$S$6:$DP$6,0)+IF(DSMTEnvironment=\"UAT\",5,3))","v":"0123u000000VQdAAAW"},250,0,null,null,null,null,250,0,null,null,null,null,150,0,"a1r3u000003Fil9AAC","0123u000000VQdAAAW","a1r790000008VFMAA2","012790000004MSZAA2",150,0,"a1r3u000003FijiAAC","0123u000000VQdAAAW","a1r790000008VpaAAE","012790000004MSZAA2",0,0.05,"a1r3u000007a59dAAA","0123u000000VQdAAAW","a1r79000000AIc4","012790000004MSZAA2",0,0.05,"a1r3u000007deRBAAY","0123u000000VQdAAAW","a1r79000000AIyCAAW","012790000004MSZAA2",220,0.06,null,null,"a1r79000000AJp1AAG","012790000004MSZAA2",200,0.03,"a1r3u0000069BuXAAU","0123u000000aP5cAAE","a1r79000000A5lC","012790000004PuSAAU",200,0.03,"a1r3u0000069DAhAAM","0123u000000aP5cAAE","a1r79000000A6UnAAK","012790000004PuSAAU",550,0,null,null,null,null,240,0,null,null,null,null,240,0,null,null,null,null,400,0,null,null,null,null,275,0.02,null,null,null,null,150,0.03,null,null,null,null,150,0.03,null,null,null,null,250,0.03,null,null,null,null,""]
[null,null,"ECM Evaporator Fan Motors for Refrigerated Display Cases",15,{"$f":"ROUND(Refrigeration!B27,3)","v":0},0,{"$f":"MAX(ROUND(Refrigeration!C27,3),E10:F10)","v":0},0,0,{"$f":"IF(OR(J$5=\"Not Entered\",$H$5=0),0,H10/$H$5*$J$5)","v":0},0,{"$f":"Refrigeration!D27","v":0},{"$f":"IFERROR(MAX(E10:F10)*LoadFactor,L10)","v":0},{"$f":"IF(Utility=\"CPS Energy\",0,INDEX($S10:$DL10,1,MATCH(Utility&Program,'Savings Summary'!$S$6:$DL$6,0)))","v":150},{"$f":"IF(Utility=\"CPS Energy\",INDEX($S10:$DL10,1,MATCH(Utility&Program,'Savings Summary'!$S$6:$DL$6,0)),0)","v":0},{"$f":"INDEX($S10:$DL10,1,MATCH(Utility&Program,'Savings Summary'!$S$6:$DL$6,0)+1)","v":0},{"$f":"INDEX(S10:DP10,1,MATCH(Utility&Program,$S$6:$DP$6,0)+IF(DSMTEnvironment = \"UAT\",4,2))","v":"a1r3u000003FilBAAS"},{"$f":"INDEX(S10:DP10,1,MATCH(Utility&Program,$S$6:$DP$6,0)+IF(DSMTEnvironment=\"UAT\",5,3))","v":"0123u000000VQdGAAW"},250,0,null,null,null,null,250,0,null,null,null,null,150,0,"a1r3u000003FilBAAS","0123u000000VQdGAAW","a1r790000008VFvAAM","012790000004MTXAA2",150,0,"a1r3u000003FijkAAC","0123u000000VQdGAAW","a1r790000008VpcAAE","012790000004MTXAA2",0,0.05,"a1r3u000007a59fAAA","0123u000000VQdGAAW","a1r79000000AIc9","012790000004MTXAA2",0,0.05,"a1r3u000007deRDAAY","0123u000000VQdGAAW","a1r79000000AIyWAAW","012790000004MTXAA2",220,0.06,null,null,"a1r79000000AJowAAG","012790000004MTXAA2",200,0.03,"a1r3u0000069BueAAE","0123u000000aP5cAAE","a1r79000000A5lg","012790000004PuSAAU",200,0.03,"a1r3u0000069DAjAAM","0123u000000aP5cAAE","a1r79000000A6V7AAK","012790000004PuSAAU",550,0,null,null,null,null,240,0,null,null,null,null,240,0,null,null,null,null,400,0,null,null,null,null,275,0.02,null,null,null,null,150,0.03,null,null,null,null,150,0.03,null,null,null,null,250,0.03,null,null,null,null,""]
[null,null,"Electronic Defrost Controls",10,{"$f":"ROUND(Refrigeration!B35,3)","v":0},0,{"$f":"MAX(ROUND(Refrigeration!C35,3),E11:F11)","v":0},0,0,0,0,{"$f":"Refrigeration!D35","v":0},{"$f":"IFERROR(MAX(E11:F11)*LoadFactor,L11)","v":0},{"$f":"IF(Utility=\"CPS Energy\",0,INDEX($S11:$DL11,1,MATCH(Utility&Program,'Savings Summary'!$S$6:$DL$6,0)))","v":150},{"$f":"IF(Utility=\"CPS Energy\",INDEX($S11:$DL11,1,MATCH(Utility&Program,'Savings Summary'!$S$6:$DL$6,0)),0)","v":0},{"$f":"INDEX($S11:$DL11,1,MATCH(Utility&Program,'Savings Summary'!$S$6:$DL$6,0)+1)","v":0},{"$f":"INDEX(S11:DP11,1,MATCH(Utility&Program,$S$6:$DP$6,0)+IF(DSMTEnvironment = \"UAT\",4,2))","v":"a1r3u000003FilKAAS"},{"$f":"INDEX(S11:DP11,1,MATCH(Utility&Program,$S$6:$DP$6,0)+IF(DSMTEnvironment=\"UAT\",5,3))","v":"0123u000000VQdJAAW"},250,0,null,null,null,null,250,0,null,null,null,null,150,0,"a1r3u000003FilKAAS","0123u000000VQdJAAW","a1r790000008VJEAA2","012790000004MWgAAM",150,0,"a1r3u000003FijtAAC","0123u000000VQdJAAW","a1r790000008VplAAE","012790000004MWgAAM",0,0.05,"a1r3u000007a59oAAA","0123u000000VQdJAAW","a1r79000000AIdb","012790000004MWgAAM",0,0.05,"a1r3u000007deRMAAY","0123u000000VQdJAAW","a1r79000000AIxoAAG","012790000004MWgAAM",220,0.06,null,null,"a1r79000000AJnKAAW","012790000004MWgAAM",200,0.03,"a1r3u0000069Bu8AAE","0123u000000aP5cAAE","a1r79000000A2od","012790000004PuSAAU",200,0.03,"a1r3u0000069DAsAAM","0123u000000aP5cAAE","a1r79000000A6XrAAK","012790000004PuSAAU",550,0,null,null,null,null,240,0,null,null,null,null,240,0,null,null,null,null,400,0,null,null,null,null,275,0.02,null,null,null,null,150,0.03,null,null,null,null,150,0.03,null,null,null,null,250,0.03,null,null,null,null,""]
[null,null,"Evaporator Fan Controls ",16,{"$f":"ROUND(Refrigeration!B41,3)","v":0},0,{"$f":"MAX(ROUND(Refrigeration!C41,3),E12:F12)","v":0},0,0,0,0,{"$f":"Refrigeration!D41","v":0},{"$f":"IFERROR(MAX(E12:F12)*LoadFactor,L12)","v":0},{"$f":"IF(Utility=\"CPS Energy\",0,INDEX($S12:$DL12,1,MATCH(Utility&Program,'Savings Summary'!$S$6:$DL$6,0)))","v":150},{"$f":"IF(Utility=\"CPS Energy\",INDEX($S12:$DL12,1,MATCH(Utility&Program,'Savings Summary'!$S$6:$DL$6,0)),0)","v":0},{"$f":"INDEX($S12:$DL12,1,MATCH(Utility&Program,'Savings Summary'!$S$6:$DL$6,0)+1)","v":0},{"$f":"INDEX(S12:DP12,1,MATCH(Utility&Program,$S$6:$DP$6,0)+IF(DSMTEnvironment = \"UAT\",4,2))","v":"a1r3u000003FilOAAS"},{"$f":"INDEX(S12:DP12,1,MATCH(Utility&Program,$S$6:$DP$6,0)+IF(DSMTEnvironment=\"UAT\",5,3))","v":"0123u000000VQdLAAW"},250,0,null,null,null,null,250,0,null,null,null,null,150,0,"a1r3u000003FilOAAS","0123u000000VQdLAAW","a1r790000008VTYAA2","012790000004MZ1AAM",150,0,"a1r3u000003FijxAAC","0123u000000VQdLAAW","a1r790000008VppAAE","012790000004MZ1AAM",0,0.05,"a1r3u000007a59sAAA","0123u000000VQdLAAW","a1r79000000AIdg","012790000004MZ1AAM",0,0.05,"a1r3u000007deRQAAY","0123u000000VQdLAAW","a1r79000000AIz0AAG","012790000004MZ1AAM",220,0.06,null,null,"a1r79000000AJpLAAW","012790000004MZ1AAM",200,0.03,"a1r3u0000069BuKAAU","0123u000000aP5pAAE","a1r79000000A5k9","012790000004PzbAAE",200,0.03,"a1r3u0000069DAwAAM","0123u000000aP5pAAE","a1r79000000A6VRAA0","012790000004PzbAAE",550,0,null,null,null,null,240,0,null,null,null,null,240,0,null,null,null,null,400,0,null,null,null,null,275,0.02,null,null,null,null,150,0.03,null,null,null,null,150,0.03,null,null,null,null,250,0.03,null,null,null,null,""]
[null,null,"Night Covers for Open Vertical and Horizontal Refrigerated Display Cases",5,{"$f":"ROUND(Refrigeration!B49,3)","v":0},0,{"$f":"MAX(ROUND(Refrigeration!C49,3),E13:F13)","v":0},0,0,0,0,{"$f":"Refrigeration!D49","v":0},{"$f":"L13","v":0},{"$f":"IF(Utility=\"CPS Energy\",0,INDEX($S13:$DL13,1,MATCH(Utility&Program,'Savings Summary'!$S$6:$DL$6,0)))","v":150},{"$f":"IF(Utility=\"CPS Energy\",INDEX($S13:$DL13,1,MATCH(Utility&Program,'Savings Summary'!$S$6:$DL$6,0)),0)","v":0},{"$f":"INDEX($S13:$DL13,1,MATCH(Utility&Program,'Savings Summary'!$S$6:$DL$6,0)+1)","v":0},{"$f":"INDEX(S13:DP13,1,MATCH(Utility&Program,$S$6:$DP$6,0)+IF(DSMTEnvironment = \"UAT\",4,2))","v":"a1r3u000003FillAAC"},{"$f":"INDEX(S13:DP13,1,MATCH(Utility&Program,$S$6:$DP$6,0)+IF(DSMTEnvironment=\"UAT\",5,3))","v":"0123u000000VQdRAAW"},250,0,null,null,null,null,250,0,null,null,null,null,150,0,"a1r3u000003FillAAC","0123u000000VQdRAAW","a1r790000008VYiAAM","012790000004MZfAAM",150,0,"a1r3u000003FikJAAS","0123u000000VQdRAAW","a1r790000008VqBAAU","012790000004MZfAAM",0,0.05,"a1r3u000007a5ALAAY","0123u000000VQdRAAW","a1r79000000AIcJ","012790000004MZfAAM",0,0.05,"a1r3u000007deRsAAI","0123u000000VQdRAAW","a1r79000000AIzAAAW","012790000004MZfAAM",220,0.06,null,null,"a1r79000000AJpQAAW","012790000004MZfAAM",200,0.03,"a1r3u0000069BuJAAU","0123u000000aP5dAAE","a1r79000000A5k4","012790000004PuTAAU",200,0.03,"a1r3u0000069DBNAA2","0123u000000aP5dAAE","a1r79000000A6W0AAK","012790000004PuTAAU",550,0,null,null,null,null,240,0,null,null,null,null,240,0,null,null,null,null,400,0,null,null,null,null,275,0.02,null,null,null,null,150,0.03,null,null,null,null,150,0.03,null,null,null,null,250,0.03,null,null,null,null,""]
[null,null,"ENERGY STAR Commercial Refrigerators",12,{"$f":"ROUND(Refrigeration!B57,3)","v":0},0,{"$f":"MAX(ROUND(Refrigeration!C57,3),E14:F14)","v":0},0,0,0,0,{"$f":"Refrigeration!D57","v":0},{"$f":"IFERROR(MAX(E14:F14)*LoadFactor,L14)","v":0},{"$f":"IF(Utility=\"CPS Energy\",0,INDEX($S14:$DL14,1,MATCH(Utility&Program,'Savings Summary'!$S$6:$DL$6,0)))","v":150},{"$f":"IF(Utility=\"CPS Energy\",INDEX($S14:$DL14,1,MATCH(Utility&Program,'Savings Summary'!$S$6:$DL$6,0)),0)","v":0},{"$f":"INDEX($S14:$DL14,1,MATCH(Utility&Program,'Savings Summary'!$S$6:$DL$6,0)+1)","v":0},{"$f":"INDEX(S14:DP14,1,MATCH(Utility&Program,$S$6:$DP$6,0)+IF(DSMTEnvironment = \"UAT\",4,2))","v":"a1r3u000003Fim5AAC"},{"$f":"INDEX(S14:DP14,1,MATCH(Utility&Program,$S$6:$DP$6,0)+IF(DSMTEnvironment=\"UAT\",5,3))","v":"0123u000000VQd6AAG"},250,0,null,null,null,null,250,0,null,null,null,null,150,0,"a1r3u000003Fim5AAC","0123u000000VQd6AAG","a1r790000008VbXAAU","012790000004MaJAAU",150,0,"a1r3u000003FikdAAC","0123u000000VQd6AAG","a1r790000008VqVAAU","012790000004MaJAAU",0,0.05,"a1r3u000007a5AfAAI","0123u000000VQd6AAG","a1r79000000AIcs","012790000004MaJAAU",0,0.05,"a1r3u000007deSCAAY","0123u000000VQd6AAG","a1r79000000AIzFAAW","012790000004MaJAAU",220,0.06,null,null,"a1r79000000AJnFAAW","012790000004MaJAAU",200,0.03,"a1r3u0000069BucAAE","0123u000000aP5yAAE","a1r79000000A5lW","012790000004PzzAAE",200,0.03,"a1r3u0000069DBiAAM","0123u000000aP5yAAE","a1r79000000A6WoAAK","012790000004PzzAAE",550,0,null,null,null,null,240,0,null,null,null,null,240,0,null,null,null,null,400,0,null,null,null,null,275,0.02,null,null,null,null,150,0.03,null,null,null,null,150,0.03,null,null,null,null,250,0.03,null,null,null,null,""]
[null,null,"Strip Curtains for Walk-In Refrigerated Storage",4,{"$f":"ROUND(Refrigeration!B63,3)","v":0},0,{"$f":"MAX(ROUND(Refrigeration!C63,3),E15:F15)","v":0},0,0,0,0,{"$f":"Refrigeration!D63","v":0},0,{"$f":"IF(Utility=\"CPS Energy\",0,INDEX($S15:$DL15,1,MATCH(Utility&Program,'Savings Summary'!$S$6:$DL$6,0)))","v":150},{"$f":"IF(Utility=\"CPS Energy\",INDEX($S15:$DL15,1,MATCH(Utility&Program,'Savings Summary'!$S$6:$DL$6,0)),0)","v":0},{"$f":"INDEX($S15:$DL15,1,MATCH(Utility&Program,'Savings Summary'!$S$6:$DL$6,0)+1)","v":0},{"$f":"INDEX(S15:DP15,1,MATCH(Utility&Program,$S$6:$DP$6,0)+IF(DSMTEnvironment = \"UAT\",4,2))","v":"a1r3u000003Fim7AAC"},{"$f":"INDEX(S15:DP15,1,MATCH(Utility&Program,$S$6:$DP$6,0)+IF(DSMTEnvironment=\"UAT\",5,3))","v":"0123u000000VQM9AAO"},250,0,null,null,null,null,250,0,null,null,null,null,150,0,"a1r3u000003Fim7AAC","0123u000000VQM9AAO","a1r790000008VbrAAE","012790000004MaiAAE",150,0,"a1r3u000003FikfAAC","0123u000000VQM9AAO","a1r790000008VqXAAU","012790000004MaiAAE",0,0.05,"a1r3u000007a5AhAAI","0123u000000VQM9AAO","a1r79000000AIcx","012790000004MaiAAE",0,0.05,"a1r3u000007deSEAAY","0123u000000VQM9AAO","a1r79000000AIzKAAW","012790000004MaiAAE",220,0.06,null,null,"a1r79000000AJnyAAG","012790000004MaiAAE",200,0.03,"a1r3u0000069BuCAAU","0123u000000aP5zAAE","a1r79000000A5jV","012790000004Q0FAAU",200,0.03,"a1r3u0000069DBkAAM","0123u000000aP5zAAE","a1r79000000A6WtAAK","012790000004Q0FAAU",550,0,null,null,null,null,240,0,null,null,null,null,240,0,null,null,null,null,400,0,null,null,null,null,275,0.02,null,null,null,null,150,0.03,null,null,null,null,150,0.03,null,null,null,null,250,0.03,null,null,null,null,""]
[null,null,"Zero-Energy Doors for Refrigerated Cases",12,{"$f":"ROUND(Refrigeration!B69,3)","v":0},0,{"$f":"MAX(ROUND(Refrigeration!C69,3),E16:F16)","v":0},0,0,{"$f":"IF(OR(J$5=\"Not Entered\",$H$5=0),0,H16/$H$5*$J$5)","v":0},{"$f":"IFERROR(G16*O16+(E16+F16)*N16+H16*P16,0)","v":0},{"$f":"Refrigeration!D69","v":0},0,{"$f":"IF(Utility=\"CPS Energy\",0,INDEX($S16:$DL16,1,MATCH(Utility&Program,'Savings Summary'!$S$6:$DL$6,0)))","v":150},{"$f":"IF(Utility=\"CPS Energy\",INDEX($S16:$DL16,1,MATCH(Utility&Program,'Savings Summary'!$S$6:$DL$6,0)),0)","v":0},{"$f":"INDEX($S16:$DL16,1,MATCH(Utility&Program,'Savings Summary'!$S$6:$DL$6,0)+1)","v":0},{"$f":"INDEX(S16:DP16,1,MATCH(Utility&Program,$S$6:$DP$6,0)+IF(DSMTEnvironment = \"UAT\",4,2))","v":"a1r3u000003FimJAAS"},{"$f":"INDEX(S16:DP16,1,MATCH(Utility&Program,$S$6:$DP$6,0)+IF(DSMTEnvironment=\"UAT\",5,3))","v":"0123u000000VQdAAAW"},250,0,null,null,null,null,250,0,null,null,null,null,150,0,"a1r3u000003FimJAAS","0123u000000VQdAAAW","a1r790000008VNGAA2","012790000004MSZAA2",150,0,"a1r3u000003FikrAAC","0123u000000VQdAAAW","a1r790000008VqjAAE","012790000004MSZAA2",0,0.05,"a1r3u000007a5AtAAI","0123u000000VQdAAAW","a1r79000000AId7","012790000004MSZAA2",0,0.05,"a1r3u000007deSQAAY","0123u000000VQdAAAW","a1r79000000AIzZAAW","012790000004MSZAA2",220,0.06,null,null,"a1r79000000AJo8AAG","012790000004MSZAA2",200,0.03,"a1r3u0000069BuiAAE","0123u000000aP5cAAE","a1r79000000A5m0","012790000004PuSAAU",200,0.03,"a1r3u0000069DBqAAM","0123u000000aP5cAAE","a1r79000000A6WFAA0","012790000004PuSAAU",550,0,null,null,null,null,240,0,null,null,null,null,240,0,null,null,null,null,400,0,null,null,null,null,275,0.02,null,null,null,null,150,0.03,null,null,null,null,150,0.03,null,null,null,null,250,0.03,null,null,null,null,""]
[null,null,"Vending Machine Controls",5,{"$f":"ROUND(Refrigeration!B75,3)","v":0},0,{"$f":"MAX(ROUND(Refrigeration!C75,3),E17:F17)","v":0},0,0,0,0,{"$f":"Refrigeration!D75","v":0},0,{"$f":"IF(Utility=\"CPS Energy\",0,INDEX($S17:$DL17,1,MATCH(Utility&Program,'Savings Summary'!$S$6:$DL$6,0)))","v":150},{"$f":"IF(Utility=\"CPS Energy\",INDEX($S17:$DL17,1,MATCH(Utility&Program,'Savings Summary'!$S$6:$DL$6,0)),0)","v":0},{"$f":"INDEX($S17:$DL17,1,MATCH(Utility&Program,'Savings Summary'!$S$6:$DL$6,0)+1)","v":0},{"$f":"INDEX(S17:DP17,1,MATCH(Utility&Program,$S$6:$DP$6,0)+IF(DSMTEnvironment = \"UAT\",4,2))","v":"a1r3u000003Fim9AAC"},{"$f":"INDEX(S17:DP17,1,MATCH(Utility&Program,$S$6:$DP$6,0)+IF(DSMTEnvironment=\"UAT\",5,3))","v":"0123u000000VQdAAAW"},250,0,null,null,null,null,250,0,null,null,null,null,150,0,"a1r3u000003Fim9AAC","0123u000000VQdAAAW","a1r790000008VNBAA2","012790000004MSZAA2",150,0,"a1r3u000003FikhAAC","0123u000000VQdAAAW","a1r790000008VqZAAU","012790000004MSZAA2",0,0.05,"a1r3u000007a5AjAAI","0123u000000VQdAAAW","a1r79000000AId2","012790000004MSZAA2",0,0.05,"a1r3u000007deSGAAY","0123u000000VQdAAAW","a1r79000000AIzPAAW","012790000004MSZAA2",220,0.06,null,null,"a1r79000000AJo3AAG","012790000004MSZAA2",200,0.03,"a1r3u0000069BuDAAU","0123u000000aP5vAAE","a1r79000000A5ja","012790000004PzwAAE",200,0.03,"a1r3u0000069DBmAAM","0123u000000aP5vAAE","a1r79000000A6WyAAK","012790000004PzwAAE",550,0,null,null,null,null,240,0,null,null,null,null,240,0,null,null,null,null,400,0,null,null,null,null,275,0.02,null,null,null,null,150,0.03,null,null,null,null,150,0.03,null,null,null,null,250,0.03,null,null,null,null,""]
[null,null,"High Speed Doors for Cold Storage",5,{"$f":"ROUND(Refrigeration!B81,3)","v":0},0,{"$f":"MAX(ROUND(Refrigeration!C81,3),E18:F18)","v":0},0,0,{"$f":"IF(OR(J$5=\"Not Entered\",$H$5=0),0,H18/$H$5*$J$5)","v":0},{"$f":"IFERROR(G18*O18+(E18+F18)*N18+H18*P18,0)","v":0},{"$f":"Refrigeration!D81","v":0},0,{"$f":"IF(Utility=\"CPS Energy\",0,INDEX($S18:$DL18,1,MATCH(Utility&Program,'Savings Summary'!$S$6:$DL$6,0)))","v":150},{"$f":"IF(Utility=\"CPS Energy\",INDEX($S18:$DL18,1,MATCH(Utility&Program,'Savings Summary'!$S$6:$DL$6,0)),0)","v":0},{"$f":"INDEX($S18:$DL18,1,MATCH(Utility&Program,'Savings Summary'!$S$6:$DL$6,0)+1)","v":0},{"$f":"INDEX(S18:DP18,1,MATCH(Utility&Program,$S$6:$DP$6,0)+IF(DSMTEnvironment = \"UAT\",4,2))","v":0},{"$f":"INDEX(S18:DP18,1,MATCH(Utility&Program,$S$6:$DP$6,0)+IF(DSMTEnvironment=\"UAT\",5,3))","v":0},250,0,null,null,null,null,250,0,null,null,null,null,150,0,null,null,null,null,150,0,null,null,null,null,0,0.05,null,null,null,null,0,0.05,null,null,null,null,220,0.06,null,null,null,null,200,0.03,null,null,null,null,200,0.03,null,null,null,null,550,0,null,null,null,null,240,0,null,null,null,null,240,0,null,null,null,null,400,0,null,null,null,null,275,0.02,null,null,null,null,150,0.03,null,null,null,null,150,0.03,null,null,null,null,250,0.03,null,null,null,null,""]
[null,"Food Service & DHW","ENERGY STAR Electric Convection Oven",12,{"$f":"ROUND('Food Service & DHW'!B8,3)","v":0},0,{"$f":"MAX(ROUND('Food Service & DHW'!C8,3),E19:F19)","v":0},0,0,{"$f":"IF(OR(J$5=\"Not Entered\",$H$5=0),0,H19/$H$5*$J$5)","v":0},0,{"$f":"'Food Service & DHW'!D8","v":0},0,{"$f":"IF(Utility=\"CPS Energy\",0,INDEX($S19:$DL19,1,MATCH(Utility&Program,'Savings Summary'!$S$6:$DL$6,0)))","v":150},{"$f":"IF(Utility=\"CPS Energy\",INDEX($S19:$DL19,1,MATCH(Utility&Program,'Savings Summary'!$S$6:$DL$6,0)),0)","v":0},{"$f":"INDEX($S19:$DL19,1,MATCH(Utility&Program,'Savings Summary'!$S$6:$DL$6,0)+1)","v":0},{"$f":"INDEX(S19:DP19,1,MATCH(Utility&Program,$S$6:$DP$6,0)+IF(DSMTEnvironment = \"UAT\",4,2))","v":"a1r3u000003FilFAAS"},{"$f":"INDEX(S19:DP19,1,MATCH(Utility&Program,$S$6:$DP$6,0)+IF(DSMTEnvironment=\"UAT\",5,3))","v":"0123u000000VQdAAAW"},250,0,null,null,null,null,250,0,null,null,null,null,150,0,"a1r3u000003FilFAAS","0123u000000VQdAAAW","a1r790000008VbhAAE","012790000004MSZAA2",150,0,"a1r3u000003FijoAAC","0123u000000VQdAAAW","a1r790000008VpgAAE","012790000004MSZAA2",0,0.04,"a1r3u000007a59jAAA","0123u000000VQdAAAW","a1r79000000AIdv","012790000004MSZAA2",0,0.04,"a1r3u000007deRHAAY","0123u000000VQdAAAW","a1r79000000AIwpAAG","012790000004MSZAA2",200,7.0000000000000007E-2,null,null,"a1r79000000AJmSAAW","012790000004MSZAA2",200,0.05,"a1r3u0000069BuRAAU","0123u000000aP5bAAE","a1r79000000A5ki","012790000004PuRAAU",200,0.05,"a1r3u0000069DAnAAM","0123u000000aP5bAAE","a1r79000000A6VHAA0","012790000004PuRAAU",550,0,null,null,null,null,240,0,null,null,null,null,240,0,null,null,null,null,400,0,null,null,null,null,165,0.02,null,null,null,null,150,0.03,null,null,null,null,150,0.03,null,null,null,null,250,0.03,null,null,null,null,""]
[null,null,"ENERGY STAR Combination Oven",12,{"$f":"ROUND('Food Service & DHW'!B14,3)","v":0},0,{"$f":"MAX(ROUND('Food Service & DHW'!C14,3),E20:F20)","v":0},0,0,{"$f":"IF(OR(J$5=\"Not Entered\",$H$5=0),0,H20/$H$5*$J$5)","v":0},0,{"$f":"'Food Service & DHW'!D14","v":0},0,{"$f":"IF(Utility=\"CPS Energy\",0,INDEX($S20:$DL20,1,MATCH(Utility&Program,'Savings Summary'!$S$6:$DL$6,0)))","v":150},{"$f":"IF(Utility=\"CPS Energy\",INDEX($S20:$DL20,1,MATCH(Utility&Program,'Savings Summary'!$S$6:$DL$6,0)),0)","v":0},{"$f":"INDEX($S20:$DL20,1,MATCH(Utility&Program,'Savings Summary'!$S$6:$DL$6,0)+1)","v":0},{"$f":"INDEX(S20:DP20,1,MATCH(Utility&Program,$S$6:$DP$6,0)+IF(DSMTEnvironment = \"UAT\",4,2))","v":"a1r3u000003FilDAAS"},{"$f":"INDEX(S20:DP20,1,MATCH(Utility&Program,$S$6:$DP$6,0)+IF(DSMTEnvironment=\"UAT\",5,3))","v":"0123u000000VQd9AAG"},250,0,null,null,null,null,250,0,null,null,null,null,150,0,"a1r3u000003FilDAAS","0123u000000VQd9AAG","a1r790000008VFHAA2","012790000004MPzAAM",150,0,"a1r3u000003FijmAAC","0123u000000VQd9AAG","a1r790000008VpeAAE","012790000004MPzAAM",0,0.04,"a1r3u000007a59hAAA","0123u000000VQd9AAG","a1r79000000AIdq","012790000004MPzAAM",0,0.04,"a1r3u000007deRFAAY","0123u000000VQd9AAG","a1r79000000AIwaAAG","012790000004MPzAAM",200,7.0000000000000007E-2,null,null,"a1r79000000AJnjAAG","012790000004MPzAAM",200,0.05,"a1r3u0000069BuMAAU","0123u000000aP5bAAE","a1r79000000A5kJ","012790000004PuRAAU",200,0.05,"a1r3u0000069DAlAAM","0123u000000aP5bAAE","a1r79000000A6VCAA0","012790000004PuRAAU",550,0,null,null,null,null,240,0,null,null,null,null,240,0,null,null,null,null,400,0,null,null,null,null,165,0.02,null,null,null,null,150,0.03,null,null,null,null,150,0.03,null,null,null,null,250,0.03,null,null,null,null,""]
[null,null,"ENERGY STAR Commercial Dishwashers",{"$f":"'Food Service & DHW'!O20","v":10},{"$f":"ROUND('Food Service & DHW'!B20,3)","v":0},0,{"$f":"MAX(ROUND('Food Service & DHW'!C20,3),E21:F21)","v":0},0,0,{"$f":"IF(OR(J$5=\"Not Entered\",$H$5=0),0,H21/$H$5*$J$5)","v":0},0,{"$f":"'Food Service & DHW'!D20","v":0},0,{"$f":"IF(Utility=\"CPS Energy\",0,INDEX($S21:$DL21,1,MATCH(Utility&Program,'Savings Summary'!$S$6:$DL$6,0)))","v":150},{"$f":"IF(Utility=\"CPS Energy\",INDEX($S21:$DL21,1,MATCH(Utility&Program,'Savings Summary'!$S$6:$DL$6,0)),0)","v":0},{"$f":"INDEX($S21:$DL21,1,MATCH(Utility&Program,'Savings Summary'!$S$6:$DL$6,0)+1)","v":0},{"$f":"INDEX(S21:DP21,1,MATCH(Utility&Program,$S$6:$DP$6,0)+IF(DSMTEnvironment = \"UAT\",4,2))","v":"a1r3u000003FikyAAC"},{"$f":"INDEX(S21:DP21,1,MATCH(Utility&Program,$S$6:$DP$6,0)+IF(DSMTEnvironment=\"UAT\",5,3))","v":"0123u000000VQd9AAG"},250,0,null,null,null,null,250,0,null,null,null,null,150,0,"a1r3u000003FikyAAC","0123u000000VQd9AAG","a1r790000008VE4AAM","012790000004MPzAAM",150,0,"a1r3u000003FijXAAS","0123u000000VQd9AAG","a1r790000008VpPAAU","012790000004MPzAAM",0,0.04,"a1r3u000007a59SAAQ","0123u000000VQd9AAG","a1r79000000AIdC","012790000004MPzAAM",0,0.04,"a1r3u000007deR0AAI","0123u000000VQd9AAG","a1r79000000AIzUAAW","012790000004MPzAAM",200,7.0000000000000007E-2,null,null,"a1r79000000AJoNAAW","012790000004MPzAAM",200,0.05,"a1r3u0000069BtXAAU","0123u000000aP5aAAE","a1r79000000A5jG","012790000004PuRAAU",200,0.05,"a1r3u0000069DAWAA2","0123u000000aP5bAAE","a1r79000000A6UdAAK","012790000004PuRAAU",550,0,null,null,null,null,240,0,null,null,null,null,240,0,null,null,null,null,400,0,null,null,null,null,165,0.02,null,null,null,null,150,0.03,null,null,null,null,150,0.03,null,null,null,null,250,0.03,null,null,null,null,""]
[null,null,"ENERGY STAR Electric Steam Cookers",12,{"$f":"ROUND('Food Service & DHW'!B26,3)","v":0},0,{"$f":"MAX(ROUND('Food Service & DHW'!C26,3),E22:F22)","v":0},0,0,0,0,{"$f":"'Food Service & DHW'!D26","v":0},0,{"$f":"IF(Utility=\"CPS Energy\",0,INDEX($S22:$DL22,1,MATCH(Utility&Program,'Savings Summary'!$S$6:$DL$6,0)))","v":150},{"$f":"IF(Utility=\"CPS Energy\",INDEX($S22:$DL22,1,MATCH(Utility&Program,'Savings Summary'!$S$6:$DL$6,0)),0)","v":0},{"$f":"INDEX($S22:$DL22,1,MATCH(Utility&Program,'Savings Summary'!$S$6:$DL$6,0)+1)","v":0},{"$f":"INDEX(S22:DP22,1,MATCH(Utility&Program,$S$6:$DP$6,0)+IF(DSMTEnvironment = \"UAT\",4,2))","v":"a1r3u000003FilHAAS"},{"$f":"INDEX(S22:DP22,1,MATCH(Utility&Program,$S$6:$DP$6,0)+IF(DSMTEnvironment=\"UAT\",5,3))","v":"0123u000000VQdHAAW"},250,0,null,null,null,null,250,0,null,null,null,null,150,0,"a1r3u000003FilHAAS","0123u000000VQdHAAW","a1r790000008VbcAAE","012790000004MaOAAU",150,0,"a1r3u000003FijqAAC","0123u000000VQdHAAW","a1r790000008VpiAAE","012790000004MaOAAU",0,0.04,"a1r3u000007a59lAAA","0123u000000VQdHAAW","a1r79000000AIdH","012790000004MaOAAU",0,0.04,"a1r3u000007deRJAAY","0123u000000VQdHAAW","a1r79000000AIx4AAG","012790000004MaOAAU",200,7.0000000000000007E-2,null,null,"a1r79000000AJoSAAW","012790000004MaOAAU",200,0.05,"a1r3u0000069Bu6AAE","0123u000000aP5cAAE","a1r79000000A2oT","012790000004PuSAAU",200,0.05,"a1r3u0000069DApAAM","0123u000000aP5cAAE","a1r79000000A6XhAAK","012790000004PuSAAU",550,0,null,null,null,null,240,0,null,null,null,null,240,0,null,null,null,null,400,0,null,null,null,null,165,0.02,null,null,null,null,150,0.03,null,null,null,null,150,0.03,null,null,null,null,250,0.03,null,null,null,null,""]
[null,null,"ENERGY STAR Electric Fryers",12,{"$f":"ROUND('Food Service & DHW'!B32,3)","v":0},0,{"$f":"MAX(ROUND('Food Service & DHW'!C32,3),E23:F23)","v":0},0,0,0,0,{"$f":"'Food Service & DHW'!D32","v":0},0,{"$f":"IF(Utility=\"CPS Energy\",0,INDEX($S23:$DL23,1,MATCH(Utility&Program,'Savings Summary'!$S$6:$DL$6,0)))","v":150},{"$f":"IF(Utility=\"CPS Energy\",INDEX($S23:$DL23,1,MATCH(Utility&Program,'Savings Summary'!$S$6:$DL$6,0)),0)","v":0},{"$f":"INDEX($S23:$DL23,1,MATCH(Utility&Program,'Savings Summary'!$S$6:$DL$6,0)+1)","v":0},{"$f":"INDEX(S23:DP23,1,MATCH(Utility&Program,$S$6:$DP$6,0)+IF(DSMTEnvironment = \"UAT\",4,2))","v":"a1r3u000003FileAAC"},{"$f":"INDEX(S23:DP23,1,MATCH(Utility&Program,$S$6:$DP$6,0)+IF(DSMTEnvironment=\"UAT\",5,3))","v":"0123u000000VQd2AAG"},250,0,null,null,null,null,250,0,null,null,null,null,150,0,"a1r3u000003FileAAC","0123u000000VQd2AAG","a1r790000008VbwAAE","012790000004Mb2AAE",150,0,"a1r3u000003FikDAAS","0123u000000VQd2AAG","a1r790000008Vq5AAE","012790000004Mb2AAE",0,0.04,"a1r3u000007a5AAAAY","0123u000000VQd2AAG","a1r79000000AIdW","012790000004Mb2AAE",0,0.04,"a1r3u000007deRiAAI","0123u000000VQd2AAG","a1r79000000AIxdAAG","012790000004Mb2AAE",200,7.0000000000000007E-2,null,null,"a1r79000000AJohAAG","012790000004Mb2AAE",200,0.05,"a1r3u0000069BubAAE","0123u000000aP5xAAE","a1r79000000A5lR","012790000004PzyAAE",200,0.05,"a1r3u0000069DBCAA2","0123u000000aP5xAAE","a1r79000000A6VqAAK","012790000004PzyAAE",550,0,null,null,null,null,240,0,null,null,null,null,240,0,null,null,null,null,400,0,null,null,null,null,165,0.02,null,null,null,null,150,0.03,null,null,null,null,150,0.03,null,null,null,null,250,0.03,null,null,null,null,""]
[null,null,"ENERGY STAR Electric Hot Food Holding Cabinets",12,{"$f":"ROUND('Food Service & DHW'!B38,3)","v":0},0,{"$f":"MAX(ROUND('Food Service & DHW'!C38,3),E24:F24)","v":0},0,0,0,0,{"$f":"'Food Service & DHW'!D38","v":0},0,{"$f":"IF(Utility=\"CPS Energy\",0,INDEX($S24:$DL24,1,MATCH(Utility&Program,'Savings Summary'!$S$6:$DL$6,0)))","v":150},{"$f":"IF(Utility=\"CPS Energy\",INDEX($S24:$DL24,1,MATCH(Utility&Program,'Savings Summary'!$S$6:$DL$6,0)),0)","v":0},{"$f":"INDEX($S24:$DL24,1,MATCH(Utility&Program,'Savings Summary'!$S$6:$DL$6,0)+1)","v":0},{"$f":"INDEX(S24:DP24,1,MATCH(Utility&Program,$S$6:$DP$6,0)+IF(DSMTEnvironment = \"UAT\",4,2))","v":"a1r3u000003FilTAAS"},{"$f":"INDEX(S24:DP24,1,MATCH(Utility&Program,$S$6:$DP$6,0)+IF(DSMTEnvironment=\"UAT\",5,3))","v":"0123u000000VQdAAAW"},250,0,null,null,null,null,250,0,null,null,null,null,150,0,"a1r3u000003FilTAAS","0123u000000VQdAAAW","a1r790000008VbmAAE","012790000004MSZAA2",150,0,"a1r3u000003Fik2AAC","0123u000000VQdAAAW","a1r790000008VpuAAE","012790000004MSZAA2",0,0.04,"a1r3u000007a59zAAA","0123u000000VQdAAAW","a1r79000000AIdM","012790000004MSZAA2",0,0.04,"a1r3u000007deRXAAY","0123u000000VQdAAAW","a1r79000000AIxEAAW","012790000004MSZAA2",200,7.0000000000000007E-2,null,null,"a1r79000000AJocAAG","012790000004MSZAA2",200,0.05,"a1r3u0000069BuHAAU","0123u000000aP5bAAE","a1r79000000A5ju","012790000004PuRAAU",200,0.05,"a1r3u0000069DB1AAM","0123u000000aP5bAAE","a1r79000000A6VbAAK","012790000004PuRAAU",550,0,null,null,null,null,240,0,null,null,null,null,240,0,null,null,null,null,400,0,null,null,null,null,165,0.02,null,null,null,null,150,0.03,null,null,null,null,150,0.03,null,null,null,null,250,0.03,null,null,null,null,""]
[null,null,"Low Flow Pre-Rinse Spray Valve",5,{"$f":"ROUND('Food Service & DHW'!B44,3)","v":0},0,{"$f":"MAX(ROUND('Food Service & DHW'!C44,3),E25:F25)","v":0},0,0,0,0,{"$f":"'Food Service & DHW'!D44","v":0},0,{"$f":"IF(Utility=\"CPS Energy\",0,INDEX($S25:$DL25,1,MATCH(Utility&Program,'Savings Summary'!$S$6:$DL$6,0)))","v":150},{"$f":"IF(Utility=\"CPS Energy\",INDEX($S25:$DL25,1,MATCH(Utility&Program,'Savings Summary'!$S$6:$DL$6,0)),0)","v":0},{"$f":"INDEX($S25:$DL25,1,MATCH(Utility&Program,'Savings Summary'!$S$6:$DL$6,0)+1)","v":0},{"$f":"INDEX(S25:DP25,1,MATCH(Utility&Program,$S$6:$DP$6,0)+IF(DSMTEnvironment = \"UAT\",4,2))","v":"a1r3u000003FilrAAC"},{"$f":"INDEX(S25:DP25,1,MATCH(Utility&Program,$S$6:$DP$6,0)+IF(DSMTEnvironment=\"UAT\",5,3))","v":"0123u000000VQdTAAW"},250,0,null,null,null,null,250,0,null,null,null,null,150,0,"a1r3u000003FilrAAC","0123u000000VQdTAAW","a1r790000008VcaAAE","012790000004MbvAAE",150,0,"a1r3u000003FikPAAS","0123u000000VQdTAAW","a1r790000008VqHAAU","012790000004MbvAAE",0,0.04,"a1r3u000007a5ARAAY","0123u000000VQdTAAW","a1r79000000AIe0","012790000004MbvAAE",0,0.04,"a1r3u000007deRyAAI","0123u000000VQdTAAW","a1r79000000AIxsAAG","012790000004MbvAAE",200,7.0000000000000007E-2,null,null,"a1r79000000AJoDAAW","012790000004MbvAAE",200,0.05,"a1r3u0000069BuWAAU","0123u000000aP5bAAE","a1r79000000A5l7","012790000004PuRAAU",200,0.05,"a1r3u0000069DBTAA2","0123u000000aP5bAAE","a1r79000000A6WKAA0","012790000004PuRAAU",550,0,null,null,null,null,240,0,null,null,null,null,240,0,null,null,null,null,400,0,null,null,null,null,165,0.02,null,null,null,null,150,0.03,null,null,null,null,150,0.03,null,null,null,null,250,0.03,null,null,null,null,""]
[null,null,"Demand Controlled Kitchen Ventilation",15,{"$f":"ROUND(IF('Food Service & DHW'!S52,'Food Service & DHW'!R52,0),3)","v":0},{"$f":"ROUND(IF('Food Service & DHW'!S52,0,'Food Service & DHW'!P52),3)","v":0},{"$f":"MAX(ROUND('Food Service & DHW'!C52,3),E26:F26)","v":0},0,0,{"$f":"IF(OR(J$5=\"Not Entered\",$H$5=0),0,H26/$H$5*$J$5)","v":0},0,{"$f":"'Food Service & DHW'!D52","v":0},0,{"$f":"IF(Utility=\"CPS Energy\",0,INDEX($S26:$DL26,1,MATCH(Utility&Program,'Savings Summary'!$S$6:$DL$6,0)))","v":150},{"$f":"IF(Utility=\"CPS Energy\",INDEX($S26:$DL26,1,MATCH(Utility&Program,'Savings Summary'!$S$6:$DL$6,0)),0)","v":0},{"$f":"INDEX($S26:$DL26,1,MATCH(Utility&Program,'Savings Summary'!$S$6:$DL$6,0)+1)","v":0},{"$f":"INDEX(S26:DP26,1,MATCH(Utility&Program,$S$6:$DP$6,0)+IF(DSMTEnvironment = \"UAT\",4,2))","v":"a1r3u000003FilcAAC"},{"$f":"INDEX(S26:DP26,1,MATCH(Utility&Program,$S$6:$DP$6,0)+IF(DSMTEnvironment=\"UAT\",5,3))","v":"0123u000000VQdAAAW"},250,0,null,null,null,null,250,0,null,null,null,null,150,0,"a1r3u000003FilcAAC","0123u000000VQdAAAW","a1r790000008VcpAAE","012790000004MSZAA2",150,0,"a1r3u000003FikBAAS","0123u000000VQdAAAW","a1r790000008Vq3AAE","012790000004MSZAA2",0,0.04,"a1r3u000007a5A8AAI","0123u000000VQdAAAW","a1r79000000AIe5","012790000004MSZAA2",0,0.04,"a1r3u000007deRgAAI","0123u000000VQdAAAW","a1r79000000AIy7AAG","012790000004MSZAA2",200,7.0000000000000007E-2,null,null,"a1r79000000AJoIAAW","012790000004MSZAA2",200,0.05,"a1r3u0000069BudAAE","0123u000000aP5cAAE","a1r79000000A5lb","012790000004PuSAAU",200,0.05,"a1r3u0000069DBAAA2","0123u000000aP5cAAE","a1r79000000A6VlAAK","012790000004PuSAAU",550,0,null,null,null,null,240,0,null,null,null,null,240,0,null,null,null,null,400,0,null,null,null,null,165,0.02,null,null,null,null,150,0.03,null,null,null,null,150,0.03,null,null,null,null,250,0.03,null,null,null,null,""]
[null,null,"ENERGY STAR Commercial Ice Makers",8.5,{"$f":"ROUND('Food Service & DHW'!B60,3)","v":0},0,{"$f":"MAX(ROUND('Food Service & DHW'!C60,3),E27:F27)","v":0},0,0,0,0,{"$f":"'Food Service & DHW'!D60","v":0},0,{"$f":"IF(Utility=\"CPS Energy\",0,INDEX($S27:$DL27,1,MATCH(Utility&Program,'Savings Summary'!$S$6:$DL$6,0)))","v":150},{"$f":"IF(Utility=\"CPS Energy\",INDEX($S27:$DL27,1,MATCH(Utility&Program,'Savings Summary'!$S$6:$DL$6,0)),0)","v":0},{"$f":"INDEX($S27:$DL27,1,MATCH(Utility&Program,'Savings Summary'!$S$6:$DL$6,0)+1)","v":0},{"$f":"INDEX(S27:DP27,1,MATCH(Utility&Program,$S$6:$DP$6,0)+IF(DSMTEnvironment = \"UAT\",4,2))","v":"a1r3u000003Fil0AAC"},{"$f":"INDEX(S27:DP27,1,MATCH(Utility&Program,$S$6:$DP$6,0)+IF(DSMTEnvironment=\"UAT\",5,3))","v":"0123u000000VQd9AAG"},250,0,null,null,null,null,250,0,null,null,null,null,150,0,"a1r3u000003Fil0AAC","0123u000000VQd9AAG","a1r790000008VFCAA2","012790000004MPzAAM",150,0,"a1r3u000003FijZAAS","0123u000000VQd9AAG","a1r790000008VpRAAU","012790000004MPzAAM",0,0.04,"a1r3u000007a59UAAQ","0123u000000VQd9AAG","a1r79000000AIdl","012790000004MPzAAM",0,0.04,"a1r3u000007deR2AAI","0123u000000VQd9AAG","a1r79000000AIwLAAW","012790000004MPzAAM",200,7.0000000000000007E-2,null,null,"a1r79000000AJnPAAW","012790000004MPzAAM",200,0.05,"a1r3u0000069BujAAE","0123u000000aP5bAAE","a1r79000000A5m5","012790000004PuRAAU",200,0.05,"a1r3u0000069DAYAA2","0123u000000aP5bAAE","a1r79000000A6UiAAK","012790000004PuRAAU",550,0,null,null,null,null,240,0,null,null,null,null,240,0,null,null,null,null,400,0,null,null,null,null,165,0.02,null,null,null,null,150,0.03,null,null,null,null,150,0.03,null,null,null,null,250,0.03,null,null,null,null,""]
[null,null,"Vacuum-Sealing & Packaging Machines",10,{"$f":"ROUND('Food Service & DHW'!B64,3)","v":0},0,{"$f":"E28","v":0},0,0,{"$f":"IF(OR(J$5=\"Not Entered\",$H$5=0),0,H28/$H$5*$J$5)","v":0},{"$f":"IFERROR(G28*O28+(E28+F28)*N28+H28*P28,0)","v":0},{"$f":"'Food Service & DHW'!D64","v":0},0,{"$f":"IF(Utility=\"CPS Energy\",0,INDEX($S28:$DL28,1,MATCH(Utility&Program,'Savings Summary'!$S$6:$DL$6,0)))","v":150},{"$f":"IF(Utility=\"CPS Energy\",INDEX($S28:$DL28,1,MATCH(Utility&Program,'Savings Summary'!$S$6:$DL$6,0)),0)","v":0},{"$f":"INDEX($S28:$DL28,1,MATCH(Utility&Program,'Savings Summary'!$S$6:$DL$6,0)+1)","v":0},{"$f":"INDEX(S28:DP28,1,MATCH(Utility&Program,$S$6:$DP$6,0)+IF(DSMTEnvironment = \"UAT\",4,2))","v":0},{"$f":"INDEX(S28:DP28,1,MATCH(Utility&Program,$S$6:$DP$6,0)+IF(DSMTEnvironment=\"UAT\",5,3))","v":0},250,0,null,null,null,null,250,0,null,null,null,null,150,0,null,null,null,null,150,0,null,null,null,null,0,0.04,null,null,null,null,0,0.04,null,null,null,null,200,7.0000000000000007E-2,null,null,null,null,200,0.05,null,null,null,null,200,0.05,null,null,null,null,550,0,null,null,null,null,240,0,null,null,null,null,240,0,null,null,null,null,400,0,null,null,null,null,165,0.02,null,null,null,null,150,0.03,null,null,null,null,150,0.03,null,null,null,null,250,0.03,null,null,null,null,""]
[null,null,"Low Flow Faucet Aerators",10,{"$f":"ROUND('Food Service & DHW'!B70,3)","v":0},0,{"$f":"MAX(ROUND('Food Service & DHW'!C70,3),E29:F29)","v":0},{"$f":"ROUND(MIN(L29:M29),0)","v":0},0,{"$f":"IF(OR(J$5=\"Not Entered\",$H$5=0),0,H29/$H$5*$J$5)","v":0},{"$f":"IFERROR(G29*O29+(E29+F29)*N29+H29*P29,0)","v":0},{"$f":"'Food Service & DHW'!D70","v":0},{"$f":"IFERROR(MAX(E29:F29)*LoadFactor,L29)","v":0},{"$f":"IF(Utility=\"CPS Energy\",0,INDEX($S29:$DL29,1,MATCH(Utility&Program,'Savings Summary'!$S$6:$DL$6,0)))","v":0},{"$f":"IF(Utility=\"CPS Energy\",INDEX($S29:$DL29,1,MATCH(Utility&Program,'Savings Summary'!$S$6:$DL$6,0)),0)","v":0},{"$f":"INDEX($S29:$DL29,1,MATCH(Utility&Program,'Savings Summary'!$S$6:$DL$6,0)+1)","v":0},{"$f":"INDEX(S29:DP29,1,MATCH(Utility&Program,$S$6:$DP$6,0)+IF(DSMTEnvironment = \"UAT\",4,2))","v":0},{"$f":"INDEX(S29:DP29,1,MATCH(Utility&Program,$S$6:$DP$6,0)+IF(DSMTEnvironment=\"UAT\",5,3))","v":0},0,0,null,null,null,null,0,0,null,null,null,null,0,0,null,null,null,null,0,0,null,null,null,null,0,0,"a1r3u000007a5AFAAY","0123u000000VQdIAAW","a1r79000000AIee","012790000004M30AAE",0,0,"a1r3u000007deRnAAI","0123u000000VQdIAAW","a1r79000000AIylAAG","012790000004M30AAE",0,0,null,null,null,null,200,0.05,"a1r3u0000069BufAAE","0123u000000aP61AAE","a1r79000000A5ll","012790000004Q0HAAU",200,0.05,"a1r3u0000069DBHAA2","0123u000000aP61AAE","a1r79000000A6XXAA0","012790000004Q0HAAU",550,0,null,null,null,null,0,0,null,null,null,null,0,0,null,null,null,null,0,0,null,null,null,null,0,0,null,null,null,null,0,0,null,null,null,null,0,0,null,null,null,null,0,0,null,null,null,null,""]
[null,null,"Low Flow Showerheads",10,{"$f":"ROUND('Food Service & DHW'!B76,3)","v":0},0,{"$f":"MAX(ROUND('Food Service & DHW'!C76,3),E30:F30)","v":0},0,0,0,{"$f":"IFERROR(G30*O30+(E30+F30)*N30+H30*P30,0)","v":0},{"$f":"'Food Service & DHW'!D76","v":0},0,{"$f":"IF(Utility=\"CPS Energy\",0,INDEX($S30:$DL30,1,MATCH(Utility&Program,'Savings Summary'!$S$6:$DL$6,0)))","v":0},{"$f":"IF(Utility=\"CPS Energy\",INDEX($S30:$DL30,1,MATCH(Utility&Program,'Savings Summary'!$S$6:$DL$6,0)),0)","v":0},{"$f":"INDEX($S30:$DL30,1,MATCH(Utility&Program,'Savings Summary'!$S$6:$DL$6,0)+1)","v":0},{"$f":"INDEX(S30:DP30,1,MATCH(Utility&Program,$S$6:$DP$6,0)+IF(DSMTEnvironment = \"UAT\",4,2))","v":0},{"$f":"INDEX(S30:DP30,1,MATCH(Utility&Program,$S$6:$DP$6,0)+IF(DSMTEnvironment=\"UAT\",5,3))","v":0},0,0,null,null,null,null,0,0,null,null,null,null,0,0,null,null,null,null,0,0,null,null,null,null,0,0,"a1r3u000007a5AHAAY","0123u000000aPHcAAM","a1r79000000AIeA","012790000004QjPAAU",0,0,"a1r3u000007deRpAAI","0123u000000aPHcAAM","a1r79000000AIyRAAW","012790000004QjPAAU",0,0,null,null,null,null,200,0.05,"a1r3u0000069BuUAAU","0123u000000aP65AAE","a1r79000000A5kx","012790000004Q0QAAU",200,0.05,"a1r3u0000069DBJAA2","0123u000000aP65AAE","a1r79000000A6XSAA0","012790000004Q0QAAU",550,0,null,null,null,null,0,0,null,null,null,null,0,0,null,null,null,null,0,0,null,null,null,null,0,0,null,null,null,null,0,0,null,null,null,null,0,0,null,null,null,null,0,0,null,null,null,null,""]
[null,null,"Temperature-Sensitive Restrictor Valves for Showers",10,{"$f":"ROUND(IF('Food Service & DHW'!Y82,'Food Service & DHW'!U82,0),3)","v":0},{"$f":"ROUND(IF('Food Service & DHW'!Y82,0,'Food Service & DHW'!X82),3)","v":0},{"$f":"MAX(ROUND('Food Service & DHW'!C82,3),E31:F31)","v":0},0,0,0,{"$f":"IFERROR(G31*O31+(E31+F31)*N31+H31*P31,0)","v":0},{"$f":"'Food Service & DHW'!D82","v":0},0,{"$f":"IF(Utility=\"CPS Energy\",0,INDEX($S31:$DL31,1,MATCH(Utility&Program,'Savings Summary'!$S$6:$DL$6,0)))","v":150},{"$f":"IF(Utility=\"CPS Energy\",INDEX($S31:$DL31,1,MATCH(Utility&Program,'Savings Summary'!$S$6:$DL$6,0)),0)","v":0},{"$f":"INDEX($S31:$DL31,1,MATCH(Utility&Program,'Savings Summary'!$S$6:$DL$6,0)+1)","v":0},{"$f":"INDEX(S31:DP31,1,MATCH(Utility&Program,$S$6:$DP$6,0)+IF(DSMTEnvironment = \"UAT\",4,2))","v":0},{"$f":"INDEX(S31:DP31,1,MATCH(Utility&Program,$S$6:$DP$6,0)+IF(DSMTEnvironment=\"UAT\",5,3))","v":0},250,0,null,null,null,null,250,0,null,null,null,null,150,0,null,null,null,null,150,0,null,null,null,null,0,0.04,null,null,null,null,0,0.04,null,null,null,null,200,7.0000000000000007E-2,null,null,null,null,200,0.05,null,null,null,null,200,0.05,null,null,null,null,550,0,null,null,null,null,240,0,null,null,null,null,240,0,null,null,null,null,400,0,null,null,null,null,165,0.02,null,null,null,null,150,0.03,null,null,null,null,150,0.03,null,null,null,null,250,0.03,null,null,null,null,""]
[null,null,"Central Domestic Hot Water (DHW) Controls",15,{"$f":"ROUND(IF('Food Service & DHW'!U89,'Food Service & DHW'!Q89,0),3)","v":0},{"$f":"ROUND(IF('Food Service & DHW'!U89,0,'Food Service & DHW'!T89),3)","v":0},{"$f":"MAX(ROUND('Food Service & DHW'!C89,3),E32:F32)","v":0},0,0,0,{"$f":"IFERROR(G32*O32+(E32+F32)*N32+H32*P32,0)","v":0},{"$f":"'Food Service & DHW'!D89","v":0},0,{"$f":"IF(Utility=\"CPS Energy\",0,INDEX($S32:$DL32,1,MATCH(Utility&Program,'Savings Summary'!$S$6:$DL$6,0)))","v":150},{"$f":"IF(Utility=\"CPS Energy\",INDEX($S32:$DL32,1,MATCH(Utility&Program,'Savings Summary'!$S$6:$DL$6,0)),0)","v":0},{"$f":"INDEX($S32:$DL32,1,MATCH(Utility&Program,'Savings Summary'!$S$6:$DL$6,0)+1)","v":0},{"$f":"INDEX(S32:DP32,1,MATCH(Utility&Program,$S$6:$DP$6,0)+IF(DSMTEnvironment = \"UAT\",4,2))","v":0},{"$f":"INDEX(S32:DP32,1,MATCH(Utility&Program,$S$6:$DP$6,0)+IF(DSMTEnvironment=\"UAT\",5,3))","v":0},250,0,null,null,null,null,250,0,null,null,null,null,150,0,null,null,null,null,150,0,null,null,null,null,0,0.04,null,null,null,null,0,0.04,null,null,null,null,200,7.0000000000000007E-2,null,null,null,null,200,0.05,null,null,null,null,200,0.05,null,null,null,null,550,0,null,null,null,null,240,0,null,null,null,null,240,0,null,null,null,null,400,0,null,null,null,null,165,0.02,null,null,null,null,150,0.03,null,null,null,null,150,0.03,null,null,null,null,250,0.03,null,null,null,null,""]
[null,"HVAC & Envelope","Cool Roofs",15,{"$f":"ROUND('HVAC & Envelope'!B8,3)","v":0},0,{"$f":"MAX(ROUND('HVAC & Envelope'!C8,3),E33:F33)","v":0},0,0,0,{"$f":"IFERROR(G33*O33+(E33+F33)*N33+H33*P33,0)","v":0},{"$f":"'HVAC & Envelope'!D8","v":0},0,{"$f":"IF(Utility=\"CPS Energy\",0,INDEX($S33:$DL33,1,MATCH(Utility&Program,'Savings Summary'!$S$6:$DL$6,0)))","v":150},{"$f":"IF(Utility=\"CPS Energy\",INDEX($S33:$DL33,1,MATCH(Utility&Program,'Savings Summary'!$S$6:$DL$6,0)),0)","v":0},{"$f":"INDEX($S33:$DL33,1,MATCH(Utility&Program,'Savings Summary'!$S$6:$DL$6,0)+1)","v":0},{"$f":"INDEX(S33:DP33,1,MATCH(Utility&Program,$S$6:$DP$6,0)+IF(DSMTEnvironment = \"UAT\",4,2))","v":"a1r3u000003Fil4AAC"},{"$f":"INDEX(S33:DP33,1,MATCH(Utility&Program,$S$6:$DP$6,0)+IF(DSMTEnvironment=\"UAT\",5,3))","v":"0123u000000VQdDAAW"},250,0,null,null,null,null,250,0,null,null,null,null,150,0,"a1r3u000003Fil4AAC","0123u000000VQdDAAW","a1r790000008V7cAAE","012790000004ML4AAM",150,0,"a1r3u000003FijdAAC","0123u000000VQdDAAW","a1r790000008VpVAAU","012790000004ML4AAM",0,0.04,"a1r3u000007a59YAAQ","0123u000000VQdDAAW","a1r79000000AIcE","012790000004ML4AAM",0,0.04,"a1r3u000007deR6AAI","0123u000000VQdDAAW","a1r79000000AIw1AAG","012790000004ML4AAM",240,0.09,null,null,"a1r79000000AJmlAAG","012790000004ML4AAM",200,0.03,"a1r3u0000069BuFAAU","0123u000000aP5yAAE","a1r79000000A5jk","012790000004PzzAAE",200,0.03,"a1r3u0000069DAcAAM","0123u000000aP5yAAE","a1r79000000A6UxAAK","012790000004PzzAAE",550,0,null,null,null,null,240,0,null,null,null,null,240,0,null,null,null,null,400,0,null,null,null,null,165,0.02,null,null,null,null,150,0.04,null,null,null,null,150,0.04,null,null,null,null,250,0.04,null,null,null,null,""]
[null,null,"Entrance & Exit Door Air Infiltration",11,{"$f":"ROUND(IF('HVAC & Envelope'!T15,'HVAC & Envelope'!Q15,0),3)","v":0},{"$f":"ROUND(IF('HVAC & Envelope'!T15,0,'HVAC & Envelope'!P15),3)","v":0},{"$f":"MAX(ROUND('HVAC & Envelope'!C15,3),E34:F34)","v":0},0,0,0,{"$f":"IFERROR(_xlfn.IFNA('HVAC & Envelope'!S15,G34*O34+(E34+F34)*N34+H34*P34),0)","v":0},{"$f":"'HVAC & Envelope'!D15","v":0},0,{"$f":"IF(Utility=\"CPS Energy\",0,INDEX($S34:$DL34,1,MATCH(Utility&Program,'Savings Summary'!$S$6:$DL$6,0)))","v":150},{"$f":"IF(Utility=\"CPS Energy\",INDEX($S34:$DL34,1,MATCH(Utility&Program,'Savings Summary'!$S$6:$DL$6,0)),0)","v":0},{"$f":"INDEX($S34:$DL34,1,MATCH(Utility&Program,'Savings Summary'!$S$6:$DL$6,0)+1)","v":0},{"$f":"INDEX(S34:DP34,1,MATCH(Utility&Program,$S$6:$DP$6,0)+IF(DSMTEnvironment = \"UAT\",4,2))","v":"a1r3u000003FilMAAS"},{"$f":"INDEX(S34:DP34,1,MATCH(Utility&Program,$S$6:$DP$6,0)+IF(DSMTEnvironment=\"UAT\",5,3))","v":"0123u000000VQdKAAW"},250,0,null,null,null,null,250,0,null,null,null,null,150,0,"a1r3u000003FilMAAS","0123u000000VQdKAAW","a1r790000008VBeAAM","012790000004Lq6AAE",150,0,"a1r3u000003FijvAAC","0123u000000VQdKAAW","a1r790000008VpnAAE","012790000004Lq6AAE",0,0.04,"a1r3u000007a59qAAA","0123u000000VQdKAAW","a1r79000000AIcO","012790000004Lq6AAE",0,0.04,"a1r3u000007deROAAY","0123u000000VQdKAAW","a1r79000000AIw6AAG","012790000004Lq6AAE",200,7.0000000000000007E-2,null,null,"a1r79000000AJmqAAG","012790000004Lq6AAE",200,0.03,"a1r3u0000069BuTAAU","0123u000000aP5pAAE","a1r79000000A5ks","012790000004PzbAAE",200,0.03,"a1r3u0000069DAuAAM","0123u000000aP5pAAE","a1r79000000A6VMAA0","012790000004PzbAAE",550,0,null,null,null,null,240,0,null,null,null,null,240,0,null,null,null,null,400,0,null,null,null,null,165,0.02,null,null,null,null,150,0.03,null,null,null,null,150,0.03,null,null,null,null,250,0.03,null,null,null,null,""]
[null,null,"Window Film Treatment",10,{"$f":"ROUND('HVAC & Envelope'!B23,3)","v":0},0,{"$f":"MAX(ROUND('HVAC & Envelope'!C23,3),E35:F35)","v":0},0,0,0,{"$f":"IFERROR(G35*O35+(E35+F35)*N35+H35*P35,0)","v":0},{"$f":"'HVAC & Envelope'!D23","v":0},0,{"$f":"IF(Utility=\"CPS Energy\",0,INDEX($S35:$DL35,1,MATCH(Utility&Program,'Savings Summary'!$S$6:$DL$6,0)))","v":150},{"$f":"IF(Utility=\"CPS Energy\",INDEX($S35:$DL35,1,MATCH(Utility&Program,'Savings Summary'!$S$6:$DL$6,0)),0)","v":0},{"$f":"INDEX($S35:$DL35,1,MATCH(Utility&Program,'Savings Summary'!$S$6:$DL$6,0)+1)","v":0},{"$f":"INDEX(S35:DP35,1,MATCH(Utility&Program,$S$6:$DP$6,0)+IF(DSMTEnvironment = \"UAT\",4,2))","v":"a1r3u000003FimHAAS"},{"$f":"INDEX(S35:DP35,1,MATCH(Utility&Program,$S$6:$DP$6,0)+IF(DSMTEnvironment=\"UAT\",5,3))","v":"0123u000000VQd7AAG"},250,0,null,null,null,null,250,0,null,null,null,null,150,0,"a1r3u000003FimHAAS","0123u000000VQd7AAG","a1r790000008VBjAAM","012790000004MSUAA2",150,0,"a1r3u000003FikpAAC","0123u000000VQd7AAG","a1r790000008VqhAAE","012790000004MSUAA2",0,0.04,"a1r3u000007a5ArAAI","0123u000000VQd7AAG","a1r79000000AIdR","012790000004MSUAA2",0,0.04,"a1r3u000007deSOAAY","0123u000000VQd7AAG","a1r79000000AIwBAAW","012790000004MSUAA2",180,0.06,null,null,"a1r79000000AJnAAAW","012790000004MSUAA2",200,0.03,"a1r3u0000069BugAAE","0123u000000aP5qAAE","a1r79000000A5lq","012790000004PzcAAE",200,0.03,"a1r3u0000069DBoAAM","0123u000000aP5qAAE","a1r79000000A6WAAA0","012790000004PzcAAE",550,0,null,null,null,null,240,0,null,null,null,null,240,0,null,null,null,null,400,0,null,null,null,null,165,0.02,null,null,null,null,150,0.03,null,null,null,null,150,0.03,null,null,null,null,250,0.03,null,null,null,null,""]
[null,null,"HVAC Variable Frequency Drives (VFD's)",15,{"$f":"ROUND('HVAC & Envelope'!N36,3)","v":0},{"$f":"ROUND('HVAC & Envelope'!O36,3)","v":0},{"$f":"MAX(ROUND('HVAC & Envelope'!C36,3),E36:F36)","v":0},0,0,{"$f":"IF(OR(J$5=\"Not Entered\",$H$5=0),0,H36/$H$5*$J$5)","v":0},0,{"$f":"'HVAC & Envelope'!D36","v":0},0,{"$f":"IF(Utility=\"CPS Energy\",0,INDEX($S36:$DL36,1,MATCH(Utility&Program,'Savings Summary'!$S$6:$DL$6,0)))","v":150},{"$f":"IF(Utility=\"CPS Energy\",INDEX($S36:$DL36,1,MATCH(Utility&Program,'Savings Summary'!$S$6:$DL$6,0)),0)","v":0},{"$f":"INDEX($S36:$DL36,1,MATCH(Utility&Program,'Savings Summary'!$S$6:$DL$6,0)+1)","v":0},{"$f":"INDEX(S36:DP36,1,MATCH(Utility&Program,$S$6:$DP$6,0)+IF(DSMTEnvironment = \"UAT\",4,2))","v":"a1r3u000003FilaAAC"},{"$f":"INDEX(S36:DP36,1,MATCH(Utility&Program,$S$6:$DP$6,0)+IF(DSMTEnvironment=\"UAT\",5,3))","v":"0123u000000VQd1AAG"},250,0,null,null,null,null,250,0,null,null,null,null,150,0,"a1r3u000003FilaAAC","0123u000000VQd1AAG","a1r790000008VNLAA2","012790000004MYwAAM",150,0,"a1r3u000003Fik9AAC","0123u000000VQd1AAG","a1r790000008Vq1AAE","012790000004MYwAAM",0,0.05,"a1r3u000007a5A6AAI","0123u000000VQd1AAG","a1r79000000AIb6","012790000004MYwAAM",0,0.05,"a1r3u000007deReAAI","0123u000000VQd1AAG","a1r79000000AIxKAAW","012790000004MYwAAM",200,0.06,null,null,"a1r79000000AJntAAG","012790000004MYwAAM",350,0.05,"a1r3u0000069BuIAAU","0123u000000aP5xAAE","a1r79000000A5jz","012790000004PzyAAE",350,0.05,"a1r3u0000069DB8AAM","0123u000000aP5xAAE","a1r79000000A6VgAAK","012790000004PzyAAE",550,0,null,null,null,null,240,0,null,null,null,null,240,0,null,null,null,null,400,0,null,null,null,null,250,0.02,null,null,null,null,100,0.03,null,null,null,null,150,0.03,null,null,null,null,250,0.03,null,null,null,null,""]
[null,null,"Condenser Air Evaporative Pre-Cooling",15,{"$f":"ROUND('HVAC & Envelope'!B44,3)","v":0},0,{"$f":"MAX(ROUND('HVAC & Envelope'!C44,3),E37:F37)","v":0},0,0,0,0,{"$f":"'HVAC & Envelope'!D44","v":0},0,{"$f":"IF(Utility=\"CPS Energy\",0,INDEX($S37:$DL37,1,MATCH(Utility&Program,'Savings Summary'!$S$6:$DL$6,0)))","v":150},{"$f":"IF(Utility=\"CPS Energy\",INDEX($S37:$DL37,1,MATCH(Utility&Program,'Savings Summary'!$S$6:$DL$6,0)),0)","v":0},{"$f":"INDEX($S37:$DL37,1,MATCH(Utility&Program,'Savings Summary'!$S$6:$DL$6,0)+1)","v":0},{"$f":"INDEX(S37:DP37,1,MATCH(Utility&Program,$S$6:$DP$6,0)+IF(DSMTEnvironment = \"UAT\",4,2))","v":"a1r3u000003Fil2AAC"},{"$f":"INDEX(S37:DP37,1,MATCH(Utility&Program,$S$6:$DP$6,0)+IF(DSMTEnvironment=\"UAT\",5,3))","v":"0123u000000VQd0AAG"},250,0,null,null,null,null,250,0,null,null,null,null,150,0,"a1r3u000003Fil2AAC","0123u000000VQd0AAG","a1r790000008VJJAA2","012790000004MXFAA2",150,0,"a1r3u000003FijbAAC","0123u000000VQd0AAG","a1r790000008VpTAAU","012790000004MXFAA2",0,0.04,"a1r3u000007a59WAAQ","0123u000000VQd0AAG","a1r79000000AIci","012790000004MXFAA2",0,0.04,"a1r3u000007deR4AAI","0123u000000VQd0AAG","a1r79000000AIwuAAG","012790000004MXFAA2",200,7.0000000000000007E-2,null,null,"a1r79000000AJpBAAW","012790000004MXFAA2",350,0.05,"a1r3u0000069BuhAAE","0123u000000aP5qAAE","a1r79000000A5lv","012790000004PzcAAE",350,0.05,"a1r3u0000069DAaAAM","0123u000000aP5qAAE","a1r79000000A6UsAAK","012790000004PzcAAE",550,0,null,null,null,null,240,0,null,null,null,null,240,0,null,null,null,null,400,0,null,null,null,null,250,0.02,null,null,null,null,150,0.03,null,null,null,null,150,0.03,null,null,null,null,250,0.03,null,null,null,null,""]
[null,null,"Lodging Occupancy Controls",10,{"$f":"ROUND('HVAC & Envelope'!B50,3)","v":0},0,{"$f":"MAX(ROUND('HVAC & Envelope'!C50,3),E38:F38)","v":0},0,0,0,0,{"$f":"'HVAC & Envelope'!D50","v":0},0,{"$f":"IF(Utility=\"CPS Energy\",0,INDEX($S38:$DL38,1,MATCH(Utility&Program,'Savings Summary'!$S$6:$DL$6,0)))","v":150},{"$f":"IF(Utility=\"CPS Energy\",INDEX($S38:$DL38,1,MATCH(Utility&Program,'Savings Summary'!$S$6:$DL$6,0)),0)","v":0},{"$f":"INDEX($S38:$DL38,1,MATCH(Utility&Program,'Savings Summary'!$S$6:$DL$6,0)+1)","v":0},{"$f":"INDEX(S38:DP38,1,MATCH(Utility&Program,$S$6:$DP$6,0)+IF(DSMTEnvironment = \"UAT\",4,2))","v":"a1r3u000003FilhAAC"},{"$f":"INDEX(S38:DP38,1,MATCH(Utility&Program,$S$6:$DP$6,0)+IF(DSMTEnvironment=\"UAT\",5,3))","v":"0123u000000VQdQAAW"},250,0,null,null,null,null,250,0,null,null,null,null,150,0,"a1r3u000003FilhAAC","0123u000000VQdQAAW","a1r790000008VLUAA2","012790000004MYIAA2",150,0,"a1r3u000003FikGAAS","0123u000000VQdQAAW","a1r790000008Vq8AAE","012790000004MYIAA2",0,0.04,"a1r3u000007a5ADAAY","0123u000000VQdQAAW","a1r79000000AIcn","012790000004MYIAA2",0,0.04,"a1r3u000007deRlAAI","0123u000000VQdQAAW","a1r79000000AIx9AAG","012790000004MYIAA2",200,7.0000000000000007E-2,null,null,"a1r79000000AJnoAAG","012790000004MYIAA2",350,0.05,"a1r3u0000069BuZAAU","0123u000000aP5uAAE","a1r79000000A5lI","012790000004PzvAAE",350,0.05,"a1r3u0000069DBFAA2","0123u000000aP5uAAE","a1r79000000A6VvAAK","012790000004PzvAAE",550,0,null,null,null,null,240,0,null,null,null,null,240,0,null,null,null,null,400,0,null,null,null,null,250,0.02,null,null,null,null,150,0.03,null,null,null,null,150,0.03,null,null,null,null,250,0.03,null,null,null,null,""]
[null,null,"Small Commercial Smart Thermostats",11,{"$f":"ROUND('HVAC & Envelope'!B56,3)","v":0},0,{"$f":"MAX(ROUND('HVAC & Envelope'!C56,3),E39:F39)","v":0},0,0,0,0,{"$f":"'HVAC & Envelope'!D56","v":0},0,{"$f":"IF(Utility=\"CPS Energy\",0,INDEX($S39:$DL39,1,MATCH(Utility&Program,'Savings Summary'!$S$6:$DL$6,0)))","v":150},{"$f":"IF(Utility=\"CPS Energy\",INDEX($S39:$DL39,1,MATCH(Utility&Program,'Savings Summary'!$S$6:$DL$6,0)),0)","v":0},{"$f":"INDEX($S39:$DL39,1,MATCH(Utility&Program,'Savings Summary'!$S$6:$DL$6,0)+1)","v":0},{"$f":"INDEX(S39:DP39,1,MATCH(Utility&Program,$S$6:$DP$6,0)+IF(DSMTEnvironment = \"UAT\",4,2))","v":"a1r3u000003Fim2AAC"},{"$f":"INDEX(S39:DP39,1,MATCH(Utility&Program,$S$6:$DP$6,0)+IF(DSMTEnvironment=\"UAT\",5,3))","v":"0123u000000VQd5AAG"},250,0,null,null,null,null,250,0,null,null,null,null,150,0,"a1r3u000003Fim2AAC","0123u000000VQd5AAG","a1r790000008VG0AAM","012790000004MTmAAM",150,0,"a1r3u000003FikaAAC","0123u000000VQd5AAG","a1r790000008VqSAAU","012790000004MTmAAM",0,0.04,"a1r3u000007a5AcAAI","0123u000000VQd5AAG","a1r79000000AIcd","012790000004MTmAAM",0,0.04,"a1r3u000007deS9AAI","0123u000000VQd5AAG","a1r79000000AIwfAAG","012790000004MTmAAM",200,7.0000000000000007E-2,null,null,"a1r79000000AJnUAAW","012790000004MTmAAM",350,0.05,"a1r3u0000069BuSAAU","0123u000000aP5pAAE","a1r79000000A5kn","012790000004PzbAAE",350,0.05,"a1r3u0000069DBfAAM","0123u000000aP5pAAE","a1r79000000A6WUAA0","012790000004PzbAAE",550,0,null,null,null,null,240,0,null,null,null,null,240,0,null,null,null,null,400,0,null,null,null,null,250,0.02,null,null,null,null,150,0.03,null,null,null,null,150,0.03,null,null,null,null,250,0.03,null,null,null,null,""]
[null,null,"High-Volume Low-Speed (HVLS) Fans",9,{"$f":"ROUND('HVAC & Envelope'!B62,3)","v":0},0,{"$f":"MAX(ROUND('HVAC & Envelope'!C62,3),E40:F40)","v":0},0,0,{"$f":"IF(OR(J$5=\"Not Entered\",$H$5=0),0,H40/$H$5*$J$5)","v":0},0,{"$f":"'HVAC & Envelope'!D62","v":0},0,{"$f":"IF(Utility=\"CPS Energy\",0,INDEX($S40:$DL40,1,MATCH(Utility&Program,'Savings Summary'!$S$6:$DL$6,0)))","v":150},{"$f":"IF(Utility=\"CPS Energy\",INDEX($S40:$DL40,1,MATCH(Utility&Program,'Savings Summary'!$S$6:$DL$6,0)),0)","v":0},{"$f":"INDEX($S40:$DL40,1,MATCH(Utility&Program,'Savings Summary'!$S$6:$DL$6,0)+1)","v":0},{"$f":"INDEX(S40:DP40,1,MATCH(Utility&Program,$S$6:$DP$6,0)+IF(DSMTEnvironment = \"UAT\",4,2))","v":"a1r3u000003FilQAAS"},{"$f":"INDEX(S40:DP40,1,MATCH(Utility&Program,$S$6:$DP$6,0)+IF(DSMTEnvironment=\"UAT\",5,3))","v":"0123u000000VQdAAAW"},250,0,null,null,null,null,250,0,null,null,null,null,150,0,"a1r3u000003FilQAAS","0123u000000VQdAAAW","a1r790000008VLKAA2","012790000004MSZAA2",150,0,"a1r3u000003FijzAAC","0123u000000VQdAAAW","a1r790000008VprAAE","012790000004MSZAA2",0,0.04,"a1r3u000007a59wAAA","0123u000000VQdAAAW","a1r79000000AIba","012790000004MSZAA2",0,0.04,"a1r3u000007deRUAAY","0123u000000VQdAAAW","a1r79000000AIxiAAG","012790000004MSZAA2",200,7.0000000000000007E-2,null,null,"a1r79000000AJorAAG","012790000004MSZAA2",350,0.05,"a1r3u0000069BuGAAU","0123u000000aP5xAAE","a1r79000000A5jp","012790000004PzyAAE",350,0.05,"a1r3u0000069DAyAAM","0123u000000aP5xAAE","a1r79000000A6VWAA0","012790000004PzyAAE",550,0,null,null,null,null,240,0,null,null,null,null,240,0,null,null,null,null,400,0,null,null,null,null,250,0.02,null,null,null,null,150,0.03,null,null,null,null,150,0.03,null,null,null,null,250,0.03,null,null,null,null,""]
[null,null,"ECM or VFD for Computer Room Air Handlers",15,{"$f":"ROUND('HVAC & Envelope'!B68,3)","v":0},0,{"$f":"MAX(ROUND('HVAC & Envelope'!C68,3),E41:F41)","v":0},0,0,{"$f":"IF(OR(J$5=\"Not Entered\",$H$5=0),0,H41/$H$5*$J$5)","v":0},{"$f":"IFERROR(G41*O41+(E41+F41)*N41+H41*P41,0)","v":0},{"$f":"'HVAC & Envelope'!D68","v":0},0,{"$f":"IF(Utility=\"CPS Energy\",0,INDEX($S41:$DL41,1,MATCH(Utility&Program,'Savings Summary'!$S$6:$DL$6,0)))","v":150},{"$f":"IF(Utility=\"CPS Energy\",INDEX($S41:$DL41,1,MATCH(Utility&Program,'Savings Summary'!$S$6:$DL$6,0)),0)","v":0},{"$f":"INDEX($S41:$DL41,1,MATCH(Utility&Program,'Savings Summary'!$S$6:$DL$6,0)+1)","v":0},{"$f":"INDEX(S41:DP41,1,MATCH(Utility&Program,$S$6:$DP$6,0)+IF(DSMTEnvironment = \"UAT\",4,2))","v":0},{"$f":"INDEX(S41:DP41,1,MATCH(Utility&Program,$S$6:$DP$6,0)+IF(DSMTEnvironment=\"UAT\",5,3))","v":0},250,0,null,null,null,null,250,0,null,null,null,null,150,0,null,null,null,null,150,0,null,null,null,null,0,0.04,null,null,null,null,0,0.04,null,null,null,null,180,7.0000000000000007E-2,null,null,null,null,350,0.05,null,null,null,null,350,0.05,null,null,null,null,550,0,null,null,null,null,240,0,null,null,null,null,240,0,null,null,null,null,400,0,null,null,null,null,250,0.02,null,null,null,null,150,0.03,null,null,null,null,150,0.03,null,null,null,null,250,0.03,null,null,null,null,""]
[null,"Motors","ENERGY STAR Commercial Pool Pumps",10,{"$f":"ROUND(Motors!B8,3)","v":0},0,{"$f":"MAX(ROUND(Motors!C8,3),E42:F42)","v":0},0,0,{"$f":"IF(OR(J$5=\"Not Entered\",$H$5=0),0,H42/$H$5*$J$5)","v":0},0,{"$f":"Motors!D8","v":0},0,{"$f":"IF(Utility=\"CPS Energy\",0,INDEX($S42:$DL42,1,MATCH(Utility&Program,'Savings Summary'!$S$6:$DL$6,0)))","v":150},{"$f":"IF(Utility=\"CPS Energy\",INDEX($S42:$DL42,1,MATCH(Utility&Program,'Savings Summary'!$S$6:$DL$6,0)),0)","v":0},{"$f":"INDEX($S42:$DL42,1,MATCH(Utility&Program,'Savings Summary'!$S$6:$DL$6,0)+1)","v":0},{"$f":"INDEX(S42:DP42,1,MATCH(Utility&Program,$S$6:$DP$6,0)+IF(DSMTEnvironment = \"UAT\",4,2))","v":"a1r3u000003FilnAAC"},{"$f":"INDEX(S42:DP42,1,MATCH(Utility&Program,$S$6:$DP$6,0)+IF(DSMTEnvironment=\"UAT\",5,3))","v":"0123u000000VQd3AAG"},250,0,null,null,null,null,250,0,null,null,null,null,150,0,"a1r3u000003FilnAAC","0123u000000VQd3AAG","a1r790000008VBoAAM","012790000004MSoAAM",150,0,"a1r3u000003FikLAAS","0123u000000VQd3AAG","a1r790000008VqDAAU","012790000004MSoAAM",0,0.04,"a1r3u000007a5ANAAY","0123u000000VQd3AAG","a1r79000000AIcT","012790000004MSoAAM",0,0.04,"a1r3u000007deRuAAI","0123u000000VQd3AAG","a1r79000000AIwQAAW","012790000004MSoAAM",180,7.0000000000000007E-2,null,null,"a1r79000000AJmvAAG","012790000004MSoAAM",200,0.05,"a1r3u0000069BuBAAU","0123u000000aP5uAAE","a1r79000000A5jQ","012790000004PzvAAE",200,0.05,"a1r3u0000069DBPAA2","0123u000000aP5uAAE","a1r79000000A6W5AAK","012790000004PzvAAE",550,0,null,null,null,null,240,0,null,null,null,null,240,0,null,null,null,null,400,0,null,null,null,null,165,0.02,null,null,null,null,150,0.03,null,null,null,null,150,0.03,null,null,null,null,250,0.03,null,null,null,null,""]
[null,null,"Premium Efficiency Motors",15,{"$f":"ROUND(Motors!B16,3)","v":0},0,{"$f":"MAX(ROUND(Motors!C16,3),E43:F43)","v":0},0,0,{"$f":"IF(OR(J$5=\"Not Entered\",$H$5=0),0,H43/$H$5*$J$5)","v":0},0,{"$f":"Motors!D16","v":0},0,{"$f":"IF(Utility=\"CPS Energy\",0,INDEX($S43:$DL43,1,MATCH(Utility&Program,'Savings Summary'!$S$6:$DL$6,0)))","v":150},{"$f":"IF(Utility=\"CPS Energy\",INDEX($S43:$DL43,1,MATCH(Utility&Program,'Savings Summary'!$S$6:$DL$6,0)),0)","v":0},{"$f":"INDEX($S43:$DL43,1,MATCH(Utility&Program,'Savings Summary'!$S$6:$DL$6,0)+1)","v":0},{"$f":"INDEX(S43:DP43,1,MATCH(Utility&Program,$S$6:$DP$6,0)+IF(DSMTEnvironment = \"UAT\",4,2))","v":"a1r3u000003FilpAAC"},{"$f":"INDEX(S43:DP43,1,MATCH(Utility&Program,$S$6:$DP$6,0)+IF(DSMTEnvironment=\"UAT\",5,3))","v":"0123u000000VQdUAAW"},250,0,null,null,null,null,250,0,null,null,null,null,150,0,"a1r3u000003FilpAAC","0123u000000VQdUAAW","a1r790000008VLPAA2","012790000004MY8AAM",150,0,"a1r3u000003FikNAAS","0123u000000VQdUAAW","a1r790000008VqFAAU","012790000004MY8AAM",0,0.04,"a1r3u000007a5APAAY","0123u000000VQdUAAW","a1r79000000AIbL","012790000004MY8AAM",0,0.04,"a1r3u000007deRwAAI","0123u000000VQdUAAW","a1r79000000AIxOAAW","012790000004MY8AAM",180,7.0000000000000007E-2,null,null,"a1r79000000AJneAAG","012790000004MY8AAM",200,0.05,"a1r3u0000069BuAAAU","0123u000000aP5wAAE","a1r79000000A5jL","012790000004PzxAAE",200,0.05,"a1r3u0000069DBRAA2","0123u000000aP5wAAE","a1r79000000A6WjAAK","012790000004PzxAAE",550,0,null,null,null,null,240,0,null,null,null,null,240,0,null,null,null,null,400,0,null,null,null,null,165,0.02,null,null,null,null,150,0.03,null,null,null,null,150,0.03,null,null,null,null,250,0.03,null,null,null,null,""]
[null,null,"Pump-Off Controllers",15,{"$f":"ROUND(Motors!B22,3)","v":0},0,{"$f":"MAX(ROUND(Motors!C22,3),E44:F44)","v":0},0,0,{"$f":"IF(OR(J$5=\"Not Entered\",$H$5=0),0,H44/$H$5*$J$5)","v":0},0,{"$f":"Motors!D22","v":0},0,{"$f":"IF(Utility=\"CPS Energy\",0,INDEX($S44:$DL44,1,MATCH(Utility&Program,'Savings Summary'!$S$6:$DL$6,0)))","v":150},{"$f":"IF(Utility=\"CPS Energy\",INDEX($S44:$DL44,1,MATCH(Utility&Program,'Savings Summary'!$S$6:$DL$6,0)),0)","v":0},{"$f":"INDEX($S44:$DL44,1,MATCH(Utility&Program,'Savings Summary'!$S$6:$DL$6,0)+1)","v":0},{"$f":"INDEX(S44:DP44,1,MATCH(Utility&Program,$S$6:$DP$6,0)+IF(DSMTEnvironment = \"UAT\",4,2))","v":"a1r3u000003FilxAAC"},{"$f":"INDEX(S44:DP44,1,MATCH(Utility&Program,$S$6:$DP$6,0)+IF(DSMTEnvironment=\"UAT\",5,3))","v":"0123u000000VQd4AAG"},250,0,null,null,null,null,250,0,null,null,null,null,150,0,"a1r3u000003FilxAAC","0123u000000VQd4AAG","a1r790000008VBtAAM","012790000004MStAAM",150,0,"a1r3u000003FikVAAS","0123u000000VQd4AAG","a1r790000008VqNAAU","012790000004MStAAM",0,0.04,"a1r3u000007a5AXAAY","0123u000000VQd4AAG","a1r79000000AIcY","012790000004MStAAM",0,0.04,"a1r3u000007deS4AAI","0123u000000VQd4AAG","a1r79000000AIzeAAG","012790000004MStAAM",180,7.0000000000000007E-2,null,null,"a1r79000000AJnZAAW","012790000004MStAAM",200,0.05,"a1r3u0000069BukAAE","0123u000000aP5vAAE","a1r79000000A5mA","012790000004PzwAAE",200,0.05,"a1r3u0000069DBZAA2","0123u000000aP5vAAE","a1r79000000A6WPAA0","012790000004PzwAAE",550,0,null,null,null,null,240,0,null,null,null,null,240,0,null,null,null,null,400,0,null,null,null,null,165,0.02,null,null,null,null,150,0.03,null,null,null,null,150,0.03,null,null,null,null,250,0.03,null,null,null,null,""]
[null,null,"VFDs for Water Pumping",12.5,0,{"$f":"ROUND(Motors!B28,3)","v":0},{"$f":"ROUND(Motors!C28,3)","v":0},0,{"$f":"IF(I$53=\"Yes\",L45/H$5*I$5,K45)","v":0},{"$f":"IF(OR(J$5=\"Not Entered\",$H$5=0),0,H45/$H$5*$J$5)","v":0},0,{"$f":"Motors!D28","v":0},0,{"$f":"IF(Utility=\"CPS Energy\",0,INDEX($S45:$DL45,1,MATCH(Utility&Program,'Savings Summary'!$S$6:$DL$6,0)))","v":150},{"$f":"IF(Utility=\"CPS Energy\",INDEX($S45:$DL45,1,MATCH(Utility&Program,'Savings Summary'!$S$6:$DL$6,0)),0)","v":0},{"$f":"INDEX($S45:$DL45,1,MATCH(Utility&Program,'Savings Summary'!$S$6:$DL$6,0)+1)","v":0},{"$f":"INDEX(S45:DP45,1,MATCH(Utility&Program,$S$6:$DP$6,0)+IF(DSMTEnvironment = \"UAT\",4,2))","v":0},{"$f":"INDEX(S45:DP45,1,MATCH(Utility&Program,$S$6:$DP$6,0)+IF(DSMTEnvironment=\"UAT\",5,3))","v":0},250,0,null,null,null,null,250,0,null,null,null,null,150,0,null,null,null,null,150,0,null,null,null,null,0,0.05,null,null,null,null,0,0.05,null,null,null,null,200,0.06,null,null,null,null,200,0.05,null,null,null,null,200,0.05,null,null,null,null,550,0,null,null,null,null,240,0,null,null,null,null,240,0,null,null,null,null,400,0,null,null,null,null,165,0.02,null,null,null,null,150,0.03,null,null,null,null,150,0.03,null,null,null,null,250,0.03,null,null,null,null,""]
[null,null,"Hydraulic Oils & Gear Lubricants",10,{"$f":"ROUND(Motors!B35,3)","v":0},0,0,0,0,0,0,{"$f":"Motors!D36","v":0},0,{"$f":"IF(Utility=\"CPS Energy\",0,INDEX($S46:$DL46,1,MATCH(Utility&Program,'Savings Summary'!$S$6:$DL$6,0)))","v":150},{"$f":"IF(Utility=\"CPS Energy\",INDEX($S46:$DL46,1,MATCH(Utility&Program,'Savings Summary'!$S$6:$DL$6,0)),0)","v":0},{"$f":"INDEX($S46:$DL46,1,MATCH(Utility&Program,'Savings Summary'!$S$6:$DL$6,0)+1)","v":0},{"$f":"INDEX(S46:DP46,1,MATCH(Utility&Program,$S$6:$DP$6,0)+IF(DSMTEnvironment = \"UAT\",4,2))","v":0},{"$f":"INDEX(S46:DP46,1,MATCH(Utility&Program,$S$6:$DP$6,0)+IF(DSMTEnvironment=\"UAT\",5,3))","v":0},250,0,null,null,null,null,250,0,null,null,null,null,150,0,null,null,null,null,150,0,null,null,null,null,0,0.04,null,null,null,null,0,0.04,null,null,null,null,200,7.0000000000000007E-2,null,null,null,null,200,0.05,null,null,null,null,200,0.05,null,null,null,null,550,0,null,null,null,null,240,0,null,null,null,null,240,0,null,null,null,null,400,0,null,null,null,null,165,0.02,null,null,null,null,150,0.03,null,null,null,null,150,0.03,null,null,null,null,250,0.03,null,null,null,null,""]
[null,"Miscellaneous","PC Power Management (PCPM)",3,{"$f":"ROUND(Misc!B9,3)","v":0},0,{"$f":"MAX(ROUND(Misc!C9,3),E47:F47)","v":0},0,0,0,0,{"$f":"Misc!D9","v":0},0,{"$f":"IF(Utility=\"CPS Energy\",0,INDEX($S47:$DL47,1,MATCH(Utility&Program,'Savings Summary'!$S$6:$DL$6,0)))","v":150},{"$f":"IF(Utility=\"CPS Energy\",INDEX($S47:$DL47,1,MATCH(Utility&Program,'Savings Summary'!$S$6:$DL$6,0)),0)","v":0},{"$f":"INDEX($S47:$DL47,1,MATCH(Utility&Program,'Savings Summary'!$S$6:$DL$6,0)+1)","v":0},{"$f":"INDEX(S47:DP47,1,MATCH(Utility&Program,$S$6:$DP$6,0)+IF(DSMTEnvironment = \"UAT\",4,2))","v":0},{"$f":"INDEX(S47:DP47,1,MATCH(Utility&Program,$S$6:$DP$6,0)+IF(DSMTEnvironment=\"UAT\",5,3))","v":0},250,0,null,null,null,null,250,0,null,null,null,null,150,0,null,null,null,null,150,0,null,null,null,null,0,0.04,null,null,null,null,0,0.04,null,null,null,null,200,7.0000000000000007E-2,null,null,null,null,200,0.05,null,null,null,null,200,0.05,null,null,null,null,550,0,null,null,null,null,240,0,null,null,null,null,240,0,null,null,null,null,400,0,null,null,null,null,165,0.02,null,null,null,null,150,0.03,null,null,null,null,150,0.03,null,null,null,null,250,0.03,null,null,null,null,""]
[null,null,"ENERGY STAR Electric Vehicle Supply Equipment (EVSE)",10,{"$f":"ROUND(IF(Misc!O15,Misc!M15,0),3)","v":0},{"$f":"ROUND(IF(Misc!O15,0,Misc!N15),3)","v":0},{"$f":"Misc!C15","v":0},0,0,0,0,{"$f":"Misc!D15","v":0},0,{"$f":"IF(Utility=\"CPS Energy\",0,INDEX($S48:$DL48,1,MATCH(Utility&Program,'Savings Summary'!$S$6:$DL$6,0)))","v":150},{"$f":"IF(Utility=\"CPS Energy\",INDEX($S48:$DL48,1,MATCH(Utility&Program,'Savings Summary'!$S$6:$DL$6,0)),0)","v":0},{"$f":"INDEX($S48:$DL48,1,MATCH(Utility&Program,'Savings Summary'!$S$6:$DL$6,0)+1)","v":0},{"$f":"INDEX(S48:DP48,1,MATCH(Utility&Program,$S$6:$DP$6,0)+IF(DSMTEnvironment = \"UAT\",4,2))","v":"a1r3u000003FilJAAS"},{"$f":"INDEX(S48:DP48,1,MATCH(Utility&Program,$S$6:$DP$6,0)+IF(DSMTEnvironment=\"UAT\",5,3))","v":"0123u000000VQdIAAW"},250,0,null,null,null,null,250,0,null,null,null,null,150,0,"a1r3u000003FilJAAS","0123u000000VQdIAAW","a1r790000008UJFAA2","012790000004M30AAE",150,0,"a1r3u000003FijsAAC","0123u000000VQdIAAW","a1r790000008VpkAAE","012790000004M30AAE",0,0.04,"a1r3u000007a59nAAA","0123u000000VQdIAAW","a1r79000000AIbz","012790000004M30AAE",0,0.04,"a1r3u000007deRLAAY","0123u000000VQdIAAW","a1r79000000AIvwAAG","012790000004M30AAE",200,7.0000000000000007E-2,null,null,"a1r79000000AJmgAAG","012790000004M30AAE",200,0.05,"a1r3u0000069BuEAAU","0123u000000aP61AAE","a1r79000000A5jf","012790000004Q0HAAU",200,0.05,"a1r3u0000069DArAAM","0123u000000aP61AAE","a1r79000000A6XNAA0","012790000004Q0HAAU",550,0,null,null,null,null,240,0,null,null,null,null,240,0,null,null,null,null,400,0,null,null,null,null,165,0.02,null,null,null,null,150,0.03,null,null,null,null,150,0.03,null,null,null,null,250,0.03,null,null,null,null,""]
[null,null,"LED Traffic Signals",5,{"$f":"ROUND(Misc!B26,3)","v":0},0,{"$f":"ROUND(Misc!C26,3)","v":0},0,0,0,0,{"$f":"Misc!D26","v":0},0,{"$f":"IF(Utility=\"CPS Energy\",0,INDEX($S49:$DL49,1,MATCH(Utility&Program,'Savings Summary'!$S$6:$DL$6,0)))","v":150},{"$f":"IF(Utility=\"CPS Energy\",INDEX($S49:$DL49,1,MATCH(Utility&Program,'Savings Summary'!$S$6:$DL$6,0)),0)","v":0},{"$f":"INDEX($S49:$DL49,1,MATCH(Utility&Program,'Savings Summary'!$S$6:$DL$6,0)+1)","v":0},{"$f":"INDEX(S49:DP49,1,MATCH(Utility&Program,$S$6:$DP$6,0)+IF(DSMTEnvironment = \"UAT\",4,2))","v":0},{"$f":"INDEX(S49:DP49,1,MATCH(Utility&Program,$S$6:$DP$6,0)+IF(DSMTEnvironment=\"UAT\",5,3))","v":0},250,0,null,null,null,null,250,0,null,null,null,null,150,0,null,null,null,null,150,0,null,null,null,null,0,0.04,null,null,null,null,0,0.04,null,null,null,null,180,0.05,null,null,null,null,200,0.05,null,null,null,null,200,0.05,null,null,null,null,550,0,null,null,null,null,240,0,null,null,null,null,240,0,null,null,null,null,400,0,null,null,null,null,165,0.02,null,null,null,null,150,0.03,null,null,null,null,150,0.03,null,null,null,null,250,0.03,null,null,null,null,""]
[null,null,"Steam Trap Repair or Replacement",6,{"$f":"ROUND(Misc!B32,3)","v":0},0,{"$f":"E50","v":0},0,0,0,0,{"$f":"Misc!D32","v":0},0,{"$f":"IF(Utility=\"CPS Energy\",0,INDEX($S50:$DL50,1,MATCH(Utility&Program,'Savings Summary'!$S$6:$DL$6,0)))","v":150},{"$f":"IF(Utility=\"CPS Energy\",INDEX($S50:$DL50,1,MATCH(Utility&Program,'Savings Summary'!$S$6:$DL$6,0)),0)","v":0},{"$f":"INDEX($S50:$DL50,1,MATCH(Utility&Program,'Savings Summary'!$S$6:$DL$6,0)+1)","v":0},{"$f":"INDEX(S50:DP50,1,MATCH(Utility&Program,$S$6:$DP$6,0)+IF(DSMTEnvironment = \"UAT\",4,2))","v":0},{"$f":"INDEX(S50:DP50,1,MATCH(Utility&Program,$S$6:$DP$6,0)+IF(DSMTEnvironment=\"UAT\",5,3))","v":0},250,0,null,null,null,null,250,0,null,null,null,null,150,0,null,null,null,null,150,0,null,null,null,null,0,0.04,null,null,null,null,0,0.04,null,null,null,null,200,7.0000000000000007E-2,null,null,null,null,200,0.05,null,null,null,null,200,0.05,null,null,null,null,550,0,null,null,null,null,240,0,null,null,null,null,240,0,null,null,null,null,400,0,null,null,null,null,165,0.02,null,null,null,null,150,0.03,null,null,null,null,150,0.03,null,null,null,null,250,0.03,null,null,null,null,""]
[null,null,"Hand Dryers",10,{"$f":"ROUND(Misc!B38,3)","v":0},0,{"$f":"E51","v":0},{"$f":"ROUND(MIN(L51:M51),0)","v":0},{"$f":"IF(I$53=\"Yes\",L51/H$5*I$5,K51)","v":0},{"$f":"IF(OR(J$5=\"Not Entered\",$H$5=0),0,H51/$H$5*$J$5)","v":0},{"$f":"IFERROR(G51*O51+(E51+F51)*N51+H51*P51,0)","v":0},{"$f":"Misc!D38","v":0},{"$f":"IFERROR(MAX(E51:F51)*LoadFactor,L51)","v":0},{"$f":"IF(Utility=\"CPS Energy\",0,INDEX($S51:$DL51,1,MATCH(Utility&Program,'Savings Summary'!$S$6:$DL$6,0)))","v":150},{"$f":"IF(Utility=\"CPS Energy\",INDEX($S51:$DL51,1,MATCH(Utility&Program,'Savings Summary'!$S$6:$DL$6,0)),0)","v":0},{"$f":"INDEX($S51:$DL51,1,MATCH(Utility&Program,'Savings Summary'!$S$6:$DL$6,0)+1)","v":0},{"$f":"INDEX(S51:DP51,1,MATCH(Utility&Program,$S$6:$DP$6,0)+IF(DSMTEnvironment = \"UAT\",4,2))","v":0},{"$f":"INDEX(S51:DP51,1,MATCH(Utility&Program,$S$6:$DP$6,0)+IF(DSMTEnvironment=\"UAT\",5,3))","v":0},250,0,null,null,null,null,250,0,null,null,null,null,150,0,null,null,null,null,150,0,null,null,null,null,0,0.04,"a1r3u000007a59uAAA","0123u000000aPHbAAM","a1r79000000AIeF","012790000004QjUAAU",0,0.04,"a1r3u000007deRSAAY","0123u000000aPHbAAM","a1r79000000AIz5AAG","012790000004QjUAAU",200,7.0000000000000007E-2,null,null,"a1r79000000AJpGAAW","012790000004QjUAAU",200,0.05,null,null,null,null,200,0.05,null,null,null,null,550,0,null,null,null,null,240,0,null,null,null,null,240,0,null,null,null,null,400,0,null,null,null,null,165,0.02,null,null,null,null,150,0.03,null,null,null,null,150,0.03,null,null,null,null,250,0.03,null,null,null,null,{"$f":"IF(H51<>0,C51&\", \",\"\")","v":""}]
[null,null,null,null,null,null,null,null,null,null,null,null,null,null,null,null,null,null,null,null,null,null,null,null,null,null,null,null,null,null,null,null,null,null,null,null,null,null,null,null,null,null,null,null,null,null,null,null,null,null,null,null,null,null,null,null,null,null,null,null,null,null,null,null,null,null,null,null,null,null,null,null,null,null,null,null,null,null,null,null,null,null,null,null,null,null,null,null,null,null,null,null,null,null,null,null,null,null,null,null,null,null,null,null,null,null,null,null,null,null,null,null,null,null,null,null,null,null,null,null,{"$f":"LEFT(_xlfn.CONCAT(DQ8:DQ50),LEN(_xlfn.CONCAT(DQ8:DQ50))-2)","v":{"$error":"#VALUE!"}}]
[null,null,null,"Version:",{"$f":"'Project Info'!K1","v":"v23.0"},null,null,"Incentive Cap?",{"$f":"IF('Project Info'!D18=\"\",\"Missing Project Cost\",IF(K5>'Utility Admin'!G2,\"Yes\",\"No\"))","v":"Missing Project Cost"}]
[null,null,null,null,null,null,null,"Load Factor Applied?",{"$f":"IF(SUM(M8:M48)=SUM(L8:L48),\"No\",\"Yes\")","v":"No"}]
[]
[null,null,null,null,null,null,null,"*Incentive amount is not guaranteed and may be subject to capping based on a percentage of project cost in accordance with program rules."]

{"sheet":"EPE PAF","index":3,"n_rows":26,"n_cols":20,"rows_kept":26,"cut":false,"hidden":true,"merged":[[10,3,10,6],[10,9,10,16],[1,3,1,14],[2,3,2,14],[3,3,3,14],[4,5,4,12],[7,3,7,16],[8,3,8,6],[8,9,8,16],[9,3,9,5],[9,9,9,16],[11,3,11,16],[12,3,12,6],[12,9,12,11],[12,14,12,16],[14,2,14,5],[14,6,14,10],[14,11,14,15],[18,1,18,16],[24,14,24,16],[15,2,15,5],[15,6,15,10],[15,11,15,15],[24,4,24,11],[20,4,20,7],[25,1,25,16],[22,8,23,9],[19,14,19,16],[19,4,19,12],[20,11,20,16]]}
[]
[null,null,null,"EL PASO ELECTRIC",null,null,null,null,null,null,null,null,null,null,null,"",null,null,null,""]
[null,null,null,"SMALL COMMERCIAL SOLUTIONS PROGRAM"]
[null,null,null,{"$f":"\"20\"&MID(version,2,2)&\" PAYMENT REQUEST FOR MEASURES:\"","v":"2023 PAYMENT REQUEST FOR MEASURES:"}]
[null,null,null,null,null,{"$f":"'Savings Summary'!DQ52","v":{"$error":"#VALUE!"}}]
[]
[null,"EPE Customer Information (as seen on EPE bill)"]
[null,null,"Company Name:"]
[null,null,"Contact Name:",null,null,null,null,null,"Title:"]
[null,null,"Contact Phone:",null,null,null,null,null,"Contact Email:"]
[null,null,"EPE Acct/Meter #:",null,null,null,null,null,"Rate:","Example: NMRT03"]
[null,null,"Service Address:"]
[null,null,"City:",null,null,null,null,null,"State:","Texas",null,null,null,"ZIP Code:"]
[]
[null,null,"Peak Demand kW Savings",null,null,null,"Energy kWh Savings",null,null,null,null,"El Paso Electric Rebate Amount"]
[null,null,{"$f":"'Savings Summary'!E5+'Savings Summary'!F5","v":0},null,null,null,{"$f":"'Savings Summary'!H5","v":0},null,null,null,null,{"$f":"'Savings Summary'!I5","v":0}]
[]
[]
[null,"I acknowledge the above measure will be installed and performed to my satisfaction. I understand the contractor is an independent contractor who is solely responsible for work provided and will be receiving the incentive from the El Paso Electric Company (EPE). I acknowledge that EPE and CLEAResult make no warranty or representation of the qualifications or technical feasibility, capability, safety or reliability of the measure installed by the contractor. I acknowledge that the project listed above would not have been accomplished or would have been completed with less efficient equipment without the assistance provided by the EPE Energy Efficiency Program. By signing below, I agree to give CLEAResult and/or EPE access to project site for inspections if necessary. Customer may contact EPE at (915) 351-4237 in the event of non-performance by contractor."]
[null,null,null,"CUSTOMER SIGNATURE:",null,null,null,null,null,null,null,null,null,"Date:"]
[null,null,null,"Contractor:",null,null,null,null,null,null,"Representative Name (Print):"]
[]
[null,null,null,null,null,null,null,null,"For Internal Use Only"]
[]
[null,null,null,"CLEAResult Signature:",null,null,null,null,null,null,null,null,null,"Date Reserved:"]
[null,"*Contractor must create project in the Contractor Portal to officially reserve funds. Funds will be reserved for 45 days, if project is not completed within this time, you will need to request an extension or funds will be forfeited."]

{"sheet":"Refrigeration","index":4,"n_rows":81,"n_cols":22,"rows_kept":81,"cut":false,"hidden":false,"merged":[[11,7,14,7],[26,5,26,9],[28,8,29,9]]}
[null,"Refrigeration Measures",null,null,null,null,null,null,null,null,null,"HIDE","HIDE","HIDE","HIDE","HIDE","HIDE","HIDE","HIDE","HIDE","HIDE","HIDE"]
[null,"Click on headings to expand or collapse sections. Blue Peak kW values indicate winter peak."]
[null,"Door Gaskets"]
["HIDE","Peak kW","NC kW","kWh","Uncapped Incentive","Quantity of Doors","Height (inches)","Width (inches)","Number of Sides","Refrigeration Temperature",null,"Total Length","kWh/ft","kW/ft","NCkW/ft"]
["HIDE",{"$f":"ROUND(IFERROR(L5*N5,0),3)","v":0},{"$f":"ROUND(IFERROR(L5*O5,0),3)","v":0},{"$f":"ROUND(IFERROR(L5*M5,0),0)","v":0},{"$f":"ROUND(IFERROR(INDEX('Savings Summary'!$P$8:$P$50,MATCH(Refrigeration!$B$3,'Savings Summary'!$C$8:$C$50,0))*D5+\nINDEX('Savings Summary'!$N$8:$N$50,MATCH(Refrigeration!$B$3,'Savings Summary'!$C$8:$C$50,0))*B5+\nINDEX('Savings Summary'!$O$8:$O$50,MATCH(Refrigeration!$B$3,'Savings Summary'!$C$8:$C$50,0))*C5,0),2)","v":0},null,null,null,null,null,null,{"$f":"F5*(2*G5+IF(I5=3,1,IF(I5=4,2,0))*H5)/12","v":0},{"$f":"INDEX('Lookup tables'!$E$3:$E$6,MATCH(Refrigeration!J5,LowMedTemp,0)+IF(Utility = \"CPS Energy\",2,0))","v":{"$error":"#N/A"}},{"$f":"INDEX('Lookup tables'!$F$3:$F$6,MATCH(Refrigeration!J5,LowMedTemp,0)+IF(Utility = \"CPS Energy\",2,0))","v":{"$error":"#N/A"}},{"$f":"INDEX('Lookup tables'!$G$3:$G$6,MATCH(Refrigeration!J5,LowMedTemp,0)+IF(Utility = \"CPS Energy\",2,0))","v":{"$error":"#N/A"}}]
["HIDE",{"$f":"ROUND(IFERROR(L6*N6,0),3)","v":0},{"$f":"ROUND(IFERROR(L6*O6,0),3)","v":0},{"$f":"ROUND(IFERROR(L6*M6,0),0)","v":0},{"$f":"ROUND(IFERROR(INDEX('Savings Summary'!$P$8:$P$50,MATCH(Refrigeration!$B$3,'Savings Summary'!$C$8:$C$50,0))*D6+\nINDEX('Savings Summary'!$N$8:$N$50,MATCH(Refrigeration!$B$3,'Savings Summary'!$C$8:$C$50,0))*B6+\nINDEX('Savings Summary'!$O$8:$O$50,MATCH(Refrigeration!$B$3,'Savings Summary'!$C$8:$C$50,0))*C6,0),2)","v":0},null,null,null,null,null,null,{"$f":"F6*(2*G6+IF(I6=3,1,IF(I6=4,2,0))*H6)/12","v":0},{"$f":"INDEX('Lookup tables'!$E$3:$E$6,MATCH(Refrigeration!J6,LowMedTemp,0)+IF(Utility = \"CPS Energy\",2,0))","v":{"$error":"#N/A"}},{"$f":"INDEX('Lookup tables'!$F$3:$F$6,MATCH(Refrigeration!J6,LowMedTemp,0)+IF(Utility = \"CPS Energy\",2,0))","v":{"$error":"#N/A"}},{"$f":"INDEX('Lookup tables'!$G$3:$G$6,MATCH(Refrigeration!J6,LowMedTemp,0)+IF(Utility = \"CPS Energy\",2,0))","v":{"$error":"#N/A"}}]
["HIDE",0,0,0,{"$f":"ROUND(IFERROR(INDEX('Savings Summary'!$P$8:$P$50,MATCH(Refrigeration!$B$3,'Savings Summary'!$C$8:$C$50,0))*D7+\nINDEX('Savings Summary'!$N$8:$N$50,MATCH(Refrigeration!$B$3,'Savings Summary'!$C$8:$C$50,0))*B7+\nINDEX('Savings Summary'!$O$8:$O$50,MATCH(Refrigeration!$B$3,'Savings Summary'!$C$8:$C$50,0))*C7,0),2)","v":0},null,null,null,null,null,null,0,{"$f":"INDEX('Lookup tables'!$E$3:$E$6,MATCH(Refrigeration!J7,LowMedTemp,0)+IF(Utility = \"CPS Energy\",2,0))","v":{"$error":"#N/A"}},{"$f":"INDEX('Lookup tables'!$F$3:$F$6,MATCH(Refrigeration!J7,LowMedTemp,0)+IF(Utility = \"CPS Energy\",2,0))","v":{"$error":"#N/A"}},{"$f":"INDEX('Lookup tables'!$G$3:$G$6,MATCH(Refrigeration!J7,LowMedTemp,0)+IF(Utility = \"CPS Energy\",2,0))","v":{"$error":"#N/A"}}]
["HIDE",0,0,0,{"$f":"ROUND(IFERROR(INDEX('Savings Summary'!$P$8:$P$50,MATCH(Refrigeration!$B$3,'Savings Summary'!$C$8:$C$50,0))*D8+\nINDEX('Savings Summary'!$N$8:$N$50,MATCH(Refrigeration!$B$3,'Savings Summary'!$C$8:$C$50,0))*B8+\nINDEX('Savings Summary'!$O$8:$O$50,MATCH(Refrigeration!$B$3,'Savings Summary'!$C$8:$C$50,0))*C8,0),2)","v":0},null,null,null,null,null,null,0,{"$f":"INDEX('Lookup tables'!$E$3:$E$6,MATCH(Refrigeration!J8,LowMedTemp,0)+IF(Utility = \"CPS Energy\",2,0))","v":{"$error":"#N/A"}},{"$f":"INDEX('Lookup tables'!$F$3:$F$6,MATCH(Refrigeration!J8,LowMedTemp,0)+IF(Utility = \"CPS Energy\",2,0))","v":{"$error":"#N/A"}},{"$f":"INDEX('Lookup tables'!$G$3:$G$6,MATCH(Refrigeration!J8,LowMedTemp,0)+IF(Utility = \"CPS Energy\",2,0))","v":{"$error":"#N/A"}}]
["HIDE",0,0,0,{"$f":"ROUND(IFERROR(INDEX('Savings Summary'!$P$8:$P$50,MATCH(Refrigeration!$B$3,'Savings Summary'!$C$8:$C$50,0))*D9+\nINDEX('Savings Summary'!$N$8:$N$50,MATCH(Refrigeration!$B$3,'Savings Summary'!$C$8:$C$50,0))*B9+\nINDEX('Savings Summary'!$O$8:$O$50,MATCH(Refrigeration!$B$3,'Savings Summary'!$C$8:$C$50,0))*C9,0),2)","v":0},null,null,null,null,null,null,0,{"$f":"INDEX('Lookup tables'!$E$3:$E$6,MATCH(Refrigeration!J9,LowMedTemp,0)+IF(Utility = \"CPS Energy\",2,0))","v":{"$error":"#N/A"}},{"$f":"INDEX('Lookup tables'!$F$3:$F$6,MATCH(Refrigeration!J9,LowMedTemp,0)+IF(Utility = \"CPS Energy\",2,0))","v":{"$error":"#N/A"}},{"$f":"INDEX('Lookup tables'!$G$3:$G$6,MATCH(Refrigeration!J9,LowMedTemp,0)+IF(Utility = \"CPS Energy\",2,0))","v":{"$error":"#N/A"}}]
["HIDE",{"$f":"SUM(B5:B9)","v":0},{"$f":"SUM(C5:C9)","v":0},{"$f":"SUM(D5:D9)","v":0},{"$f":"SUM(E5:E9)","v":0}]
[null,"Door Heater Controls for Refrigerated Display Cases "]
["HIDE","Peak kW","NC kW","kWh","Uncapped Incentive","Linear Feet (width) of Case*","Refrigeration Temperature","*Quantity is linear feet (width) of the case(s) controlled antisweat heaters. Typical width of a single reach-in refrigerated display case door is »  2.5 ft."]
["HIDE",{"$f":"ROUND(IFERROR(F13*VLOOKUP(State&SelectedZone,'Lookup tables'!$D$36:$J$41,IF(G13=\"Low Temperature\",6,IF(G13=\"Medium Temperature\",3)),FALSE),0),3)","v":0},{"$f":"ROUND(IFERROR(F13*VLOOKUP(State&SelectedZone,'Lookup tables'!$D$36:$J$41,IF(G13=\"Low Temperature\",7,IF(G13=\"Medium Temperature\",4)),FALSE),0),3)","v":0},{"$f":"ROUND(IFERROR(F13*INDEX(IF(G13=\"Low Temperature\",'Lookup tables'!$H$36:$H$41,IF(G13=\"Medium Temperature\",'Lookup tables'!$E$36:$E$41)),MATCH(State&SelectedZone,'Lookup tables'!$D$36:$D$41,0)),0),0)","v":0},{"$f":"ROUND(IFERROR(INDEX('Savings Summary'!$P$8:$P$50,MATCH(Refrigeration!$B$11,'Savings Summary'!$C$8:$C$50,0))*D13+\nINDEX('Savings Summary'!$N$8:$N$50,MATCH(Refrigeration!$B$11,'Savings Summary'!$C$8:$C$50,0))*B13+\nINDEX('Savings Summary'!$O$8:$O$50,MATCH(Refrigeration!$B$11,'Savings Summary'!$C$8:$C$50,0))*C13,0),2)","v":0}]
["HIDE",{"$f":"ROUND(IFERROR(F14*VLOOKUP(State&SelectedZone,'Lookup tables'!$D$36:$J$41,IF(G14=\"Low Temperature\",6,IF(G14=\"Medium Temperature\",3)),FALSE),0),3)","v":0},{"$f":"ROUND(IFERROR(F14*VLOOKUP(State&SelectedZone,'Lookup tables'!$D$36:$J$41,IF(G14=\"Low Temperature\",7,IF(G14=\"Medium Temperature\",4)),FALSE),0),3)","v":0},{"$f":"ROUND(IFERROR(F14*INDEX(IF(G14=\"Low Temperature\",'Lookup tables'!$H$36:$H$41,IF(G14=\"Medium Temperature\",'Lookup tables'!$E$36:$E$41)),MATCH(State&SelectedZone,'Lookup tables'!$D$36:$D$41,0)),0),0)","v":0},{"$f":"ROUND(IFERROR(INDEX('Savings Summary'!$P$8:$P$50,MATCH(Refrigeration!$B$11,'Savings Summary'!$C$8:$C$50,0))*D14+\nINDEX('Savings Summary'!$N$8:$N$50,MATCH(Refrigeration!$B$11,'Savings Summary'!$C$8:$C$50,0))*B14+\nINDEX('Savings Summary'!$O$8:$O$50,MATCH(Refrigeration!$B$11,'Savings Summary'!$C$8:$C$50,0))*C14,0),2)","v":0}]
["HIDE",{"$f":"ROUND(IFERROR(F15*VLOOKUP(State&SelectedZone,'Lookup tables'!$D$36:$J$41,IF(G15=\"Low Temperature\",6,IF(G15=\"Medium Temperature\",3)),FALSE),0),3)","v":0},{"$f":"ROUND(IFERROR(F15*VLOOKUP(State&SelectedZone,'Lookup tables'!$D$36:$J$41,IF(G15=\"Low Temperature\",7,IF(G15=\"Medium Temperature\",4)),FALSE),0),3)","v":0},{"$f":"ROUND(IFERROR(F15*INDEX(IF(G15=\"Low Temperature\",'Lookup tables'!$H$36:$H$41,IF(G15=\"Medium Temperature\",'Lookup tables'!$E$36:$E$41)),MATCH(State&SelectedZone,'Lookup tables'!$D$36:$D$41,0)),0),0)","v":0},{"$f":"ROUND(IFERROR(INDEX('Savings Summary'!$P$8:$P$50,MATCH(Refrigeration!$B$11,'Savings Summary'!$C$8:$C$50,0))*D15+\nINDEX('Savings Summary'!$N$8:$N$50,MATCH(Refrigeration!$B$11,'Savings Summary'!$C$8:$C$50,0))*B15+\nINDEX('Savings Summary'!$O$8:$O$50,MATCH(Refrigeration!$B$11,'Savings Summary'!$C$8:$C$50,0))*C15,0),2)","v":0}]
["HIDE",{"$f":"SUM(B13:B15)","v":0},{"$f":"SUM(C13:C15)","v":0},{"$f":"SUM(D13:D15)","v":0},{"$f":"SUM(E13:E15)","v":0}]
[null,"ECM Evaporator Fan Motors for Refrigerated Display Cases"]
["HIDE","Peak kW","NC kW","kWh","Uncapped Incentive","# of Evaporator Fan Motors","Refrigeration Temperature","Nominal Motor Size","Evaporator Fan Controls?","Existing Motor Type",null,"COP","Wbase","%off","Hours","DC","LF","DF","NCP DF","Wee","kWperunit","kWhperunit"]
["HIDE",{"$f":"ROUND(IFERROR(F19*U19*R19,0),3)","v":0},{"$f":"ROUND(IF(OR(F19=\"\",H19=\"\",G19=\"\",I19=\"\"),0,IFERROR(F19*U19*S19,0)),3)","v":0},{"$f":"ROUND(IFERROR(F19*V19,0),0)","v":0},{"$f":"ROUND(IFERROR(INDEX('Savings Summary'!$P$8:$P$50,MATCH(Refrigeration!$B$17,'Savings Summary'!$C$8:$C$50,0))*D19+\nINDEX('Savings Summary'!$N$8:$N$50,MATCH(Refrigeration!$B$17,'Savings Summary'!$C$8:$C$50,0))*B19+\nINDEX('Savings Summary'!$O$8:$O$50,MATCH(Refrigeration!$B$17,'Savings Summary'!$C$8:$C$50,0))*C19,0),2)","v":0},null,null,null,null,null,null,{"$f":"INDEX(IF(G19=\"Medium Temperature\",'Lookup tables'!$E$26:$E$31,'Lookup tables'!$F$26:$F$31),MATCH(State&SelectedZone,Locations,0))","v":2.44},{"$f":"INDEX('Lookup tables'!$P$25:$Q$30,MATCH(Refrigeration!H19,'Lookup tables'!$N$25:$N$30,0),MATCH(Refrigeration!J19,'Lookup tables'!$P$24:$Q$24,0))","v":{"$error":"#N/A"}},{"$f":"VLOOKUP(I19,'Lookup tables'!$H$24:$I$25,2,FALSE)","v":{"$error":"#N/A"}},8760,{"$f":"VLOOKUP(G19,'Lookup tables'!$K$28:$L$29,2,FALSE)","v":{"$error":"#N/A"}},0.9,{"$f":"IFERROR(VLOOKUP(State&SelectedZone,'Lookup tables'!$D$26:$G$31,4,FALSE),1)","v":1},{"$f":"NCFr","v":1},{"$f":"VLOOKUP(H19,'Lookup tables'!$N$25:$R$30,5,FALSE)","v":{"$error":"#N/A"}},{"$f":"(M19-T19)/1000*Q19*P19*(1+1/L19)","v":{"$error":"#N/A"}},{"$f":"U19*O19*(1-N19)","v":{"$error":"#N/A"}}]
["HIDE",{"$f":"ROUND(IFERROR(F20*U20*R20,0),3)","v":0},{"$f":"ROUND(IF(OR(F20=\"\",H20=\"\",G20=\"\",I20=\"\"),0,IFERROR(F20*U20*S20,0)),3)","v":0},{"$f":"ROUND(IFERROR(F20*V20,0),0)","v":0},{"$f":"ROUND(IFERROR(INDEX('Savings Summary'!$P$8:$P$50,MATCH(Refrigeration!$B$17,'Savings Summary'!$C$8:$C$50,0))*D20+\nINDEX('Savings Summary'!$N$8:$N$50,MATCH(Refrigeration!$B$17,'Savings Summary'!$C$8:$C$50,0))*B20+\nINDEX('Savings Summary'!$O$8:$O$50,MATCH(Refrigeration!$B$17,'Savings Summary'!$C$8:$C$50,0))*C20,0),2)","v":0},null,null,null,null,null,null,{"$f":"INDEX(IF(G20=\"Medium Temperature\",'Lookup tables'!$E$26:$E$31,'Lookup tables'!$F$26:$F$31),MATCH(State&SelectedZone,Locations,0))","v":2.44},{"$f":"INDEX('Lookup tables'!$P$25:$Q$30,MATCH(Refrigeration!H20,'Lookup tables'!$N$25:$N$30,0),MATCH(Refrigeration!J20,'Lookup tables'!$P$24:$Q$24,0))","v":{"$error":"#N/A"}},{"$f":"VLOOKUP(I20,'Lookup tables'!$H$24:$I$25,2,FALSE)","v":{"$error":"#N/A"}},8760,{"$f":"VLOOKUP(G20,'Lookup tables'!$K$28:$L$29,2,FALSE)","v":{"$error":"#N/A"}},0.9,{"$f":"IFERROR(VLOOKUP(State&SelectedZone,'Lookup tables'!$D$26:$G$31,4,FALSE),1)","v":1},1,{"$f":"VLOOKUP(H20,'Lookup tables'!$N$25:$R$30,5,FALSE)","v":{"$error":"#N/A"}},{"$f":"(M20-T20)/1000*Q20*P20*(1+1/L20)","v":{"$error":"#N/A"}},{"$f":"U20*O20*(1-N20)","v":{"$error":"#N/A"}}]
["HIDE",0,0,0,{"$f":"ROUND(IFERROR(INDEX('Savings Summary'!$P$8:$P$50,MATCH(Refrigeration!$B$17,'Savings Summary'!$C$8:$C$50,0))*D21+\nINDEX('Savings Summary'!$N$8:$N$50,MATCH(Refrigeration!$B$17,'Savings Summary'!$C$8:$C$50,0))*B21+\nINDEX('Savings Summary'!$O$8:$O$50,MATCH(Refrigeration!$B$17,'Savings Summary'!$C$8:$C$50,0))*C21,0),2)","v":0},null,null,null,null,null,null,{"$f":"INDEX(IF(G21=\"Medium Temperature\",'Lookup tables'!$E$26:$E$31,'Lookup tables'!$F$26:$F$31),MATCH(State&SelectedZone,Locations,0))","v":2.44},{"$f":"INDEX('Lookup tables'!$P$25:$Q$30,MATCH(Refrigeration!H21,'Lookup tables'!$N$25:$N$30,0),MATCH(Refrigeration!J21,'Lookup tables'!$P$24:$Q$24,0))","v":{"$error":"#N/A"}},{"$f":"VLOOKUP(I21,'Lookup tables'!$H$24:$I$25,2,FALSE)","v":{"$error":"#N/A"}},8760,{"$f":"VLOOKUP(G21,'Lookup tables'!$K$28:$L$29,2,FALSE)","v":{"$error":"#N/A"}},0.9,{"$f":"IFERROR(VLOOKUP(State&SelectedZone,'Lookup tables'!$D$26:$G$31,4,FALSE),1)","v":1},1,{"$f":"VLOOKUP(H21,'Lookup tables'!$N$25:$R$30,5,FALSE)","v":{"$error":"#N/A"}},{"$error":"#N/A"},{"$error":"#N/A"}]
["HIDE",0,0,0,{"$f":"ROUND(IFERROR(INDEX('Savings Summary'!$P$8:$P$50,MATCH(Refrigeration!$B$17,'Savings Summary'!$C$8:$C$50,0))*D22+\nINDEX('Savings Summary'!$N$8:$N$50,MATCH(Refrigeration!$B$17,'Savings Summary'!$C$8:$C$50,0))*B22+\nINDEX('Savings Summary'!$O$8:$O$50,MATCH(Refrigeration!$B$17,'Savings Summary'!$C$8:$C$50,0))*C22,0),2)","v":0},null,null,null,null,null,null,{"$f":"INDEX(IF(G22=\"Medium Temperature\",'Lookup tables'!$E$26:$E$31,'Lookup tables'!$F$26:$F$31),MATCH(State&SelectedZone,Locations,0))","v":2.44},{"$f":"INDEX('Lookup tables'!$P$25:$Q$30,MATCH(Refrigeration!H22,'Lookup tables'!$N$25:$N$30,0),MATCH(Refrigeration!J22,'Lookup tables'!$P$24:$Q$24,0))","v":{"$error":"#N/A"}},{"$f":"VLOOKUP(I22,'Lookup tables'!$H$24:$I$25,2,FALSE)","v":{"$error":"#N/A"}},8760,{"$f":"VLOOKUP(G22,'Lookup tables'!$K$28:$L$29,2,FALSE)","v":{"$error":"#N/A"}},0.9,{"$f":"IFERROR(VLOOKUP(State&SelectedZone,'Lookup tables'!$D$26:$G$31,4,FALSE),1)","v":1},1,{"$f":"VLOOKUP(H22,'Lookup tables'!$N$25:$R$30,5,FALSE)","v":{"$error":"#N/A"}},{"$error":"#N/A"},{"$error":"#N/A"}]
["HIDE",0,0,0,{"$f":"ROUND(IFERROR(INDEX('Savings Summary'!$P$8:$P$50,MATCH(Refrigeration!$B$17,'Savings Summary'!$C$8:$C$50,0))*D23+\nINDEX('Savings Summary'!$N$8:$N$50,MATCH(Refrigeration!$B$17,'Savings Summary'!$C$8:$C$50,0))*B23+\nINDEX('Savings Summary'!$O$8:$O$50,MATCH(Refrigeration!$B$17,'Savings Summary'!$C$8:$C$50,0))*C23,0),2)","v":0},null,null,null,null,null,null,{"$f":"INDEX(IF(G23=\"Medium Temperature\",'Lookup tables'!$E$26:$E$31,'Lookup tables'!$F$26:$F$31),MATCH(State&SelectedZone,Locations,0))","v":2.44},{"$f":"INDEX('Lookup tables'!$P$25:$Q$30,MATCH(Refrigeration!H23,'Lookup tables'!$N$25:$N$30,0),MATCH(Refrigeration!J23,'Lookup tables'!$P$24:$Q$24,0))","v":{"$error":"#N/A"}},{"$f":"VLOOKUP(I23,'Lookup tables'!$H$24:$I$25,2,FALSE)","v":{"$error":"#N/A"}},8760,{"$f":"VLOOKUP(G23,'Lookup tables'!$K$28:$L$29,2,FALSE)","v":{"$error":"#N/A"}},0.9,{"$f":"IFERROR(VLOOKUP(State&SelectedZone,'Lookup tables'!$D$26:$G$31,4,FALSE),1)","v":1},1,{"$f":"VLOOKUP(H23,'Lookup tables'!$N$25:$R$30,5,FALSE)","v":{"$error":"#N/A"}},{"$error":"#N/A"},{"$error":"#N/A"}]
["HIDE",0,0,0,{"$f":"ROUND(IFERROR(INDEX('Savings Summary'!$P$8:$P$50,MATCH(Refrigeration!$B$17,'Savings Summary'!$C$8:$C$50,0))*D24+\nINDEX('Savings Summary'!$N$8:$N$50,MATCH(Refrigeration!$B$17,'Savings Summary'!$C$8:$C$50,0))*B24+\nINDEX('Savings Summary'!$O$8:$O$50,MATCH(Refrigeration!$B$17,'Savings Summary'!$C$8:$C$50,0))*C24,0),2)","v":0},null,null,null,null,null,null,{"$f":"INDEX(IF(G24=\"Medium Temperature\",'Lookup tables'!$E$26:$E$31,'Lookup tables'!$F$26:$F$31),MATCH(State&SelectedZone,Locations,0))","v":2.44},{"$f":"INDEX('Lookup tables'!$P$25:$Q$30,MATCH(Refrigeration!H24,'Lookup tables'!$N$25:$N$30,0),MATCH(Refrigeration!J24,'Lookup tables'!$P$24:$Q$24,0))","v":{"$error":"#N/A"}},{"$f":"VLOOKUP(I24,'Lookup tables'!$H$24:$I$25,2,FALSE)","v":{"$error":"#N/A"}},8760,{"$f":"VLOOKUP(G24,'Lookup tables'!$K$28:$L$29,2,FALSE)","v":{"$error":"#N/A"}},0.9,{"$f":"IFERROR(VLOOKUP(State&SelectedZone,'Lookup tables'!$D$26:$G$31,4,FALSE),1)","v":1},1,{"$f":"VLOOKUP(H24,'Lookup tables'!$N$25:$R$30,5,FALSE)","v":{"$error":"#N/A"}},{"$error":"#N/A"},{"$error":"#N/A"}]
["HIDE",0,0,0,{"$f":"ROUND(IFERROR(INDEX('Savings Summary'!$P$8:$P$50,MATCH(Refrigeration!$B$17,'Savings Summary'!$C$8:$C$50,0))*D25+\nINDEX('Savings Summary'!$N$8:$N$50,MATCH(Refrigeration!$B$17,'Savings Summary'!$C$8:$C$50,0))*B25+\nINDEX('Savings Summary'!$O$8:$O$50,MATCH(Refrigeration!$B$17,'Savings Summary'!$C$8:$C$50,0))*C25,0),2)","v":0},null,null,null,null,null,null,{"$f":"INDEX(IF(G25=\"Medium Temperature\",'Lookup tables'!$E$26:$E$31,'Lookup tables'!$F$26:$F$31),MATCH(State&SelectedZone,Locations,0))","v":2.44},{"$f":"INDEX('Lookup tables'!$P$25:$Q$30,MATCH(Refrigeration!H25,'Lookup tables'!$N$25:$N$30,0),MATCH(Refrigeration!J25,'Lookup tables'!$P$24:$Q$24,0))","v":{"$error":"#N/A"}},{"$f":"VLOOKUP(I25,'Lookup tables'!$H$24:$I$25,2,FALSE)","v":{"$error":"#N/A"}},8760,{"$f":"VLOOKUP(G25,'Lookup tables'!$K$28:$L$29,2,FALSE)","v":{"$error":"#N/A"}},0.9,{"$f":"IFERROR(VLOOKUP(State&SelectedZone,'Lookup tables'!$D$26:$G$31,4,FALSE),1)","v":1},1,{"$f":"VLOOKUP(H25,'Lookup tables'!$N$25:$R$30,5,FALSE)","v":{"$error":"#N/A"}},{"$error":"#N/A"},{"$error":"#N/A"}]
["HIDE",0,0,0,{"$f":"ROUND(IFERROR(INDEX('Savings Summary'!$P$8:$P$50,MATCH(Refrigeration!$B$17,'Savings Summary'!$C$8:$C$50,0))*D26+\nINDEX('Savings Summary'!$N$8:$N$50,MATCH(Refrigeration!$B$17,'Savings Summary'!$C$8:$C$50,0))*B26+\nINDEX('Savings Summary'!$O$8:$O$50,MATCH(Refrigeration!$B$17,'Savings Summary'!$C$8:$C$50,0))*C26,0),2)","v":0},null,null,null,null,null,null,{"$f":"INDEX(IF(G26=\"Medium Temperature\",'Lookup tables'!$E$26:$E$31,'Lookup tables'!$F$26:$F$31),MATCH(State&SelectedZone,Locations,0))","v":2.44},{"$f":"INDEX('Lookup tables'!$P$25:$Q$30,MATCH(Refrigeration!H26,'Lookup tables'!$N$25:$N$30,0),MATCH(Refrigeration!J26,'Lookup tables'!$P$24:$Q$24,0))","v":{"$error":"#N/A"}},{"$f":"VLOOKUP(I26,'Lookup tables'!$H$24:$I$25,2,FALSE)","v":{"$error":"#N/A"}},8760,{"$f":"VLOOKUP(G26,'Lookup tables'!$K$28:$L$29,2,FALSE)","v":{"$error":"#N/A"}},0.9,{"$f":"IFERROR(VLOOKUP(State&SelectedZone,'Lookup tables'!$D$26:$G$31,4,FALSE),1)","v":1},1,{"$f":"VLOOKUP(H26,'Lookup tables'!$N$25:$R$30,5,FALSE)","v":{"$error":"#N/A"}},{"$error":"#N/A"},{"$error":"#N/A"}]
["HIDE",{"$f":"SUM(B19:B26)","v":0},{"$f":"SUM(C19:C26)","v":0},{"$f":"SUM(D19:D26)","v":0},{"$f":"SUM(E19:E26)","v":0}]
[null,"Electronic Defrost Controls"]
["HIDE","Peak kW","NC kW","kWh","Uncapped Incentive","Load of electric defrost (W)","Refrigeration Temperature","Hours per Year Defrost Occurs Without Controls*","*Locate defrost timer. \nHours = frequency(cycles) x duration(min)/60 x 365 "]
["HIDE",{"$f":"ROUND(IFERROR(D30/H30*VLOOKUP(State&SelectedZone,'Lookup tables'!$D$87:$G$92,4,FALSE),0),3)","v":0},{"$f":"ROUND(IFERROR(D30/H30,0),3)","v":0},{"$f":"ROUND(IFERROR(0.35*F30/1000*H30*(1+0.28*INDEX('Lookup tables'!$E$87:$F$92,MATCH(State&SelectedZone,'Lookup tables'!$D$87:$D$92,0),MATCH(G30,'Lookup tables'!$E$84:$F$84,0))),0),0)","v":0},{"$f":"ROUND(IFERROR(INDEX('Savings Summary'!$P$8:$P$50,MATCH(Refrigeration!$B$28,'Savings Summary'!$C$8:$C$50,0))*D30+\nINDEX('Savings Summary'!$N$8:$N$50,MATCH(Refrigeration!$B$28,'Savings Summary'!$C$8:$C$50,0))*B30+\nINDEX('Savings Summary'!$O$8:$O$50,MATCH(Refrigeration!$B$28,'Savings Summary'!$C$8:$C$50,0))*C30,0),2)","v":0}]
["HIDE",{"$f":"ROUND(IFERROR(D31/H31*VLOOKUP(State&SelectedZone,'Lookup tables'!$D$87:$G$92,4,FALSE),0),3)","v":0},{"$f":"ROUND(IFERROR(D31/H31,0),3)","v":0},{"$f":"ROUND(IFERROR(0.35*F31/1000*H31*(1+0.28*INDEX('Lookup tables'!$E$87:$F$92,MATCH(State&SelectedZone,'Lookup tables'!$D$87:$D$92,0),MATCH(G31,'Lookup tables'!$E$84:$F$84,0))),0),0)","v":0},{"$f":"ROUND(IFERROR(INDEX('Savings Summary'!$P$8:$P$50,MATCH(Refrigeration!$B$28,'Savings Summary'!$C$8:$C$50,0))*D31+\nINDEX('Savings Summary'!$N$8:$N$50,MATCH(Refrigeration!$B$28,'Savings Summary'!$C$8:$C$50,0))*B31+\nINDEX('Savings Summary'!$O$8:$O$50,MATCH(Refrigeration!$B$28,'Savings Summary'!$C$8:$C$50,0))*C31,0),2)","v":0}]
["HIDE",{"$f":"ROUND(IFERROR(D32/H32*VLOOKUP(State&SelectedZone,'Lookup tables'!$D$87:$G$92,4,FALSE),0),3)","v":0},0,{"$f":"ROUND(IFERROR(0.35*F32/1000*H32*(1+0.28*INDEX('Lookup tables'!$E$87:$F$92,MATCH(State&SelectedZone,'Lookup tables'!$D$87:$D$92,0),MATCH(G32,'Lookup tables'!$E$84:$F$84,0))),0),0)","v":0},{"$f":"ROUND(IFERROR(INDEX('Savings Summary'!$P$8:$P$50,MATCH(Refrigeration!$B$28,'Savings Summary'!$C$8:$C$50,0))*D32+\nINDEX('Savings Summary'!$N$8:$N$50,MATCH(Refrigeration!$B$28,'Savings Summary'!$C$8:$C$50,0))*B32+\nINDEX('Savings Summary'!$O$8:$O$50,MATCH(Refrigeration!$B$28,'Savings Summary'!$C$8:$C$50,0))*C32,0),2)","v":0}]
["HIDE",{"$f":"ROUND(IFERROR(D33/H33*VLOOKUP(State&SelectedZone,'Lookup tables'!$D$87:$G$92,4,FALSE),0),3)","v":0},0,{"$f":"ROUND(IFERROR(0.35*F33/1000*H33*(1+0.28*INDEX('Lookup tables'!$E$87:$F$92,MATCH(State&SelectedZone,'Lookup tables'!$D$87:$D$92,0),MATCH(G33,'Lookup tables'!$E$84:$F$84,0))),0),0)","v":0},{"$f":"ROUND(IFERROR(INDEX('Savings Summary'!$P$8:$P$50,MATCH(Refrigeration!$B$28,'Savings Summary'!$C$8:$C$50,0))*D33+\nINDEX('Savings Summary'!$N$8:$N$50,MATCH(Refrigeration!$B$28,'Savings Summary'!$C$8:$C$50,0))*B33+\nINDEX('Savings Summary'!$O$8:$O$50,MATCH(Refrigeration!$B$28,'Savings Summary'!$C$8:$C$50,0))*C33,0),2)","v":0}]
["HIDE",{"$f":"ROUND(IFERROR(D34/H34*VLOOKUP(State&SelectedZone,'Lookup tables'!$D$87:$G$92,4,FALSE),0),3)","v":0},0,{"$f":"ROUND(IFERROR(0.35*F34/1000*H34*(1+0.28*INDEX('Lookup tables'!$E$87:$F$92,MATCH(State&SelectedZone,'Lookup tables'!$D$87:$D$92,0),MATCH(G34,'Lookup tables'!$E$84:$F$84,0))),0),0)","v":0},{"$f":"ROUND(IFERROR(INDEX('Savings Summary'!$P$8:$P$50,MATCH(Refrigeration!$B$28,'Savings Summary'!$C$8:$C$50,0))*D34+\nINDEX('Savings Summary'!$N$8:$N$50,MATCH(Refrigeration!$B$28,'Savings Summary'!$C$8:$C$50,0))*B34+\nINDEX('Savings Summary'!$O$8:$O$50,MATCH(Refrigeration!$B$28,'Savings Summary'!$C$8:$C$50,0))*C34,0),2)","v":0}]
["HIDE",{"$f":"SUM(B30:B34)","v":0},{"$f":"SUM(C30:C34)","v":0},{"$f":"SUM(D30:D34)","v":0},{"$f":"SUM(E30:E34)","v":0}]
[null,"Evaporator Fan Controls "]
["HIDE","Peak kW","NC kW","kWh","Uncapped Incentive","Number of Evaporator Fans","Refrigeration Temperature"]
["HIDE",{"$f":"ROUND(IFERROR(IF(F38=\"\",0,(0.123*F38-0.035)*(1-0.5)*VLOOKUP(G38,'Lookup tables'!$D$78:$F$80,2,FALSE)*VLOOKUP(G38,'Lookup tables'!$D$78:$F$80,3,FALSE)*IF(SelectedZone=\"CPS\",CFr,1)),0),3)","v":0},{"$f":"ROUND(IFERROR(IF(F38=\"\",0,(0.123*F38-0.035)*(1-0.5)*VLOOKUP(G38,'Lookup tables'!$D$78:$F$80,2,FALSE)*VLOOKUP(G38,'Lookup tables'!$D$78:$F$80,3,FALSE)*NCFr),0),3)","v":0},{"$f":"ROUND(IFERROR(IF(F38=\"\",0,(0.123*F38-0.035)*(1-0.5)*VLOOKUP(G38,'Lookup tables'!$D$78:$F$80,2,FALSE)*VLOOKUP(G38,'Lookup tables'!$D$78:$F$80,3,FALSE)*8760),0),0)","v":0},{"$f":"ROUND(IFERROR(INDEX('Savings Summary'!$P$8:$P$50,MATCH(Refrigeration!$B$36,'Savings Summary'!$C$8:$C$50,0))*D38+\nINDEX('Savings Summary'!$N$8:$N$50,MATCH(Refrigeration!$B$36,'Savings Summary'!$C$8:$C$50,0))*B38+\nINDEX('Savings Summary'!$O$8:$O$50,MATCH(Refrigeration!$B$36,'Savings Summary'!$C$8:$C$50,0))*C38,0),2)","v":0}]
["HIDE",{"$f":"ROUND(IFERROR(IF(F39=\"\",0,(0.123*F39-0.035)*(1-0.5)*VLOOKUP(G39,'Lookup tables'!$D$78:$F$80,2,FALSE)*VLOOKUP(G39,'Lookup tables'!$D$78:$F$80,3,FALSE)*IF(SelectedZone=\"CPS\",CFr,1)),0),3)","v":0},{"$f":"ROUND(IFERROR(IF(F39=\"\",0,(0.123*F39-0.035)*(1-0.5)*VLOOKUP(G39,'Lookup tables'!$D$78:$F$80,2,FALSE)*VLOOKUP(G39,'Lookup tables'!$D$78:$F$80,3,FALSE)*NCFr),0),3)","v":0},{"$f":"ROUND(IFERROR(IF(F39=\"\",0,(0.123*F39-0.035)*(1-0.5)*VLOOKUP(G39,'Lookup tables'!$D$78:$F$80,2,FALSE)*VLOOKUP(G39,'Lookup tables'!$D$78:$F$80,3,FALSE)*8760),0),0)","v":0},{"$f":"ROUND(IFERROR(INDEX('Savings Summary'!$P$8:$P$50,MATCH(Refrigeration!$B$36,'Savings Summary'!$C$8:$C$50,0))*D39+\nINDEX('Savings Summary'!$N$8:$N$50,MATCH(Refrigeration!$B$36,'Savings Summary'!$C$8:$C$50,0))*B39+\nINDEX('Savings Summary'!$O$8:$O$50,MATCH(Refrigeration!$B$36,'Savings Summary'!$C$8:$C$50,0))*C39,0),2)","v":0}]
["HIDE",{"$f":"ROUND(IFERROR(IF(F40=\"\",0,(0.123*F40-0.035)*(1-0.5)*VLOOKUP(G40,'Lookup tables'!$D$78:$F$80,2,FALSE)*VLOOKUP(G40,'Lookup tables'!$D$78:$F$80,3,FALSE)*IF(SelectedZone=\"CPS\",CFr,1)),0),3)","v":0},{"$f":"ROUND(IFERROR(IF(F40=\"\",0,(0.123*F40-0.035)*(1-0.5)*VLOOKUP(G40,'Lookup tables'!$D$78:$F$80,2,FALSE)*VLOOKUP(G40,'Lookup tables'!$D$78:$F$80,3,FALSE)*NCFr),0),3)","v":0},{"$f":"ROUND(IFERROR(IF(F40=\"\",0,(0.123*F40-0.035)*(1-0.5)*VLOOKUP(G40,'Lookup tables'!$D$78:$F$80,2,FALSE)*VLOOKUP(G40,'Lookup tables'!$D$78:$F$80,3,FALSE)*8760),0),0)","v":0},{"$f":"ROUND(IFERROR(INDEX('Savings Summary'!$P$8:$P$50,MATCH(Refrigeration!$B$36,'Savings Summary'!$C$8:$C$50,0))*D40+\nINDEX('Savings Summary'!$N$8:$N$50,MATCH(Refrigeration!$B$36,'Savings Summary'!$C$8:$C$50,0))*B40+\nINDEX('Savings Summary'!$O$8:$O$50,MATCH(Refrigeration!$B$36,'Savings Summary'!$C$8:$C$50,0))*C40,0),2)","v":0}]
["HIDE",{"$f":"SUM(B38:B40)","v":0},{"$f":"SUM(C38:C40)","v":0},{"$f":"SUM(D38:D40)","v":0},{"$f":"SUM(E38:E40)","v":0}]
[null,"Night Covers for Open Vertical and Horizontal Refrigerated Display Cases"]
["HIDE","Peak kW","NC kW","kWh","Uncapped Incentive","Linear Feet (width) of Case*","Refrigeration Temperature","Condensing Unit Configuration","Display Case Orientation"]
["HIDE",0,{"$f":"ROUND(IFERROR(INDEX('Lookup tables'!$E$13:$E$19,MATCH(Refrigeration!G44&Refrigeration!H44&Refrigeration!I44,'Lookup tables'!$D$13:$D$19,0))*F44,0),3)","v":0},{"$f":"ROUND(IFERROR(INDEX('Lookup tables'!$F$13:$F$19,MATCH(Refrigeration!G44&Refrigeration!H44&Refrigeration!I44,'Lookup tables'!$D$13:$D$19,0))*F44,0),0)","v":0},{"$f":"ROUND(IFERROR(INDEX('Savings Summary'!$P$8:$P$50,MATCH(Refrigeration!$B$42,'Savings Summary'!$C$8:$C$50,0))*D44+\nINDEX('Savings Summary'!$N$8:$N$50,MATCH(Refrigeration!$B$42,'Savings Summary'!$C$8:$C$50,0))*B44+\nINDEX('Savings Summary'!$O$8:$O$50,MATCH(Refrigeration!$B$42,'Savings Summary'!$C$8:$C$50,0))*C44,0),2)","v":0}]
["HIDE",0,{"$f":"ROUND(IFERROR(INDEX('Lookup tables'!$E$13:$E$19,MATCH(Refrigeration!G45&Refrigeration!H45&Refrigeration!I45,'Lookup tables'!$D$13:$D$19,0))*F45,0),3)","v":0},{"$f":"ROUND(IFERROR(INDEX('Lookup tables'!$F$13:$F$19,MATCH(Refrigeration!G45&Refrigeration!H45&Refrigeration!I45,'Lookup tables'!$D$13:$D$19,0))*F45,0),0)","v":0},{"$f":"ROUND(IFERROR(INDEX('Savings Summary'!$P$8:$P$50,MATCH(Refrigeration!$B$42,'Savings Summary'!$C$8:$C$50,0))*D45+\nINDEX('Savings Summary'!$N$8:$N$50,MATCH(Refrigeration!$B$42,'Savings Summary'!$C$8:$C$50,0))*B45+\nINDEX('Savings Summary'!$O$8:$O$50,MATCH(Refrigeration!$B$42,'Savings Summary'!$C$8:$C$50,0))*C45,0),2)","v":0}]
["HIDE",0,{"$f":"ROUND(IFERROR(INDEX('Lookup tables'!$E$13:$E$19,MATCH(Refrigeration!G46&Refrigeration!H46&Refrigeration!I46,'Lookup tables'!$D$13:$D$19,0))*F46,0),3)","v":0},{"$f":"ROUND(IFERROR(INDEX('Lookup tables'!$F$13:$F$19,MATCH(Refrigeration!G46&Refrigeration!H46&Refrigeration!I46,'Lookup tables'!$D$13:$D$19,0))*F46,0),0)","v":0},{"$f":"ROUND(IFERROR(INDEX('Savings Summary'!$P$8:$P$50,MATCH(Refrigeration!$B$42,'Savings Summary'!$C$8:$C$50,0))*D46+\nINDEX('Savings Summary'!$N$8:$N$50,MATCH(Refrigeration!$B$42,'Savings Summary'!$C$8:$C$50,0))*B46+\nINDEX('Savings Summary'!$O$8:$O$50,MATCH(Refrigeration!$B$42,'Savings Summary'!$C$8:$C$50,0))*C46,0),2)","v":0}]
["HIDE",0,{"$f":"ROUND(IFERROR(INDEX('Lookup tables'!$E$13:$E$19,MATCH(Refrigeration!G47&Refrigeration!H47&Refrigeration!I47,'Lookup tables'!$D$13:$D$19,0))*F47,0),3)","v":0},{"$f":"ROUND(IFERROR(INDEX('Lookup tables'!$F$13:$F$19,MATCH(Refrigeration!G47&Refrigeration!H47&Refrigeration!I47,'Lookup tables'!$D$13:$D$19,0))*F47,0),0)","v":0},{"$f":"ROUND(IFERROR(INDEX('Savings Summary'!$P$8:$P$50,MATCH(Refrigeration!$B$42,'Savings Summary'!$C$8:$C$50,0))*D47+\nINDEX('Savings Summary'!$N$8:$N$50,MATCH(Refrigeration!$B$42,'Savings Summary'!$C$8:$C$50,0))*B47+\nINDEX('Savings Summary'!$O$8:$O$50,MATCH(Refrigeration!$B$42,'Savings Summary'!$C$8:$C$50,0))*C47,0),2)","v":0}]
["HIDE",0,{"$f":"ROUND(IFERROR(INDEX('Lookup tables'!$E$13:$E$19,MATCH(Refrigeration!G48&Refrigeration!H48&Refrigeration!I48,'Lookup tables'!$D$13:$D$19,0))*F48,0),3)","v":0},{"$f":"ROUND(IFERROR(INDEX('Lookup tables'!$F$13:$F$19,MATCH(Refrigeration!G48&Refrigeration!H48&Refrigeration!I48,'Lookup tables'!$D$13:$D$19,0))*F48,0),0)","v":0},{"$f":"ROUND(IFERROR(INDEX('Savings Summary'!$P$8:$P$50,MATCH(Refrigeration!$B$42,'Savings Summary'!$C$8:$C$50,0))*D48+\nINDEX('Savings Summary'!$N$8:$N$50,MATCH(Refrigeration!$B$42,'Savings Summary'!$C$8:$C$50,0))*B48+\nINDEX('Savings Summary'!$O$8:$O$50,MATCH(Refrigeration!$B$42,'Savings Summary'!$C$8:$C$50,0))*C48,0),2)","v":0}]
["HIDE",{"$f":"SUM(B44:B48)","v":0},{"$f":"SUM(C44:C48)","v":0},{"$f":"SUM(D44:D48)","v":0},{"$f":"SUM(E44:E48)","v":0},"*Quantity is linear feet (width) of the case(s) getting Night Covers installed. Typical width of a single reach-in refrigerated display case door is »  2.5 ft."]
[null,"ENERGY STAR Commercial Refrigerators"]
["HIDE","Peak kW","NC kW","kWh","Uncapped Incentive","Number of Cases","Model #","Interior Volume (cubic feet)","Unit Type","Door Type"]
["HIDE",{"$f":"ROUND(IFERROR(IF(COUNTA(H52:J52)<3,0,INDEX('Lookup tables'!$G$45:$G$60,IF(Refrigeration!I52=\"Freezer\",8,0)+IF(Refrigeration!J52=\"Glass\",4,0)+MATCH(H52,'Lookup tables'!$E$45:$E$48,1))),0)*F52,3)","v":0},{"$f":"ROUND(IFERROR(D52/8760*NCFr,0),3)","v":0},{"$f":"ROUND(IFERROR(IF(COUNTA(H52:J52)<3,0,INDEX('Lookup tables'!$F$45:$F$60,IF(Refrigeration!I52=\"Freezer\",8,0)+IF(Refrigeration!J52=\"Glass\",4,0)+MATCH(H52,'Lookup tables'!$E$45:$E$48,1))),0)*F52,0)","v":0},{"$f":"ROUND(IFERROR(INDEX('Savings Summary'!$P$8:$P$50,MATCH(Refrigeration!$B$50,'Savings Summary'!$C$8:$C$50,0))*D52+\nINDEX('Savings Summary'!$N$8:$N$50,MATCH(Refrigeration!$B$50,'Savings Summary'!$C$8:$C$50,0))*B52+\nINDEX('Savings Summary'!$O$8:$O$50,MATCH(Refrigeration!$B$50,'Savings Summary'!$C$8:$C$50,0))*C52,0),2)","v":0}]
["HIDE",{"$f":"ROUND(IFERROR(IF(COUNTA(H53:J53)<3,0,INDEX('Lookup tables'!$G$45:$G$60,IF(Refrigeration!I53=\"Freezer\",8,0)+IF(Refrigeration!J53=\"Glass\",4,0)+MATCH(H53,'Lookup tables'!$E$45:$E$48,1))),0)*F53,3)","v":0},{"$f":"ROUND(IFERROR(D53/8760*NCFr,0),3)","v":0},{"$f":"ROUND(IFERROR(IF(COUNTA(H53:J53)<3,0,INDEX('Lookup tables'!$F$45:$F$60,IF(Refrigeration!I53=\"Freezer\",8,0)+IF(Refrigeration!J53=\"Glass\",4,0)+MATCH(H53,'Lookup tables'!$E$45:$E$48,1))),0)*F53,0)","v":0},{"$f":"ROUND(IFERROR(INDEX('Savings Summary'!$P$8:$P$50,MATCH(Refrigeration!$B$50,'Savings Summary'!$C$8:$C$50,0))*D53+\nINDEX('Savings Summary'!$N$8:$N$50,MATCH(Refrigeration!$B$50,'Savings Summary'!$C$8:$C$50,0))*B53+\nINDEX('Savings Summary'!$O$8:$O$50,MATCH(Refrigeration!$B$50,'Savings Summary'!$C$8:$C$50,0))*C53,0),2)","v":0}]
["HIDE",{"$f":"ROUND(IFERROR(IF(COUNTA(H54:J54)<3,0,INDEX('Lookup tables'!$G$45:$G$60,IF(Refrigeration!I54=\"Freezer\",8,0)+IF(Refrigeration!J54=\"Glass\",4,0)+MATCH(H54,'Lookup tables'!$E$45:$E$48,1))),0)*F54,3)","v":0},{"$f":"ROUND(IFERROR(D54/8760*NCFr,0),3)","v":0},{"$f":"ROUND(IFERROR(IF(COUNTA(H54:J54)<3,0,INDEX('Lookup tables'!$F$45:$F$60,IF(Refrigeration!I54=\"Freezer\",8,0)+IF(Refrigeration!J54=\"Glass\",4,0)+MATCH(H54,'Lookup tables'!$E$45:$E$48,1))),0)*F54,0)","v":0},{"$f":"ROUND(IFERROR(INDEX('Savings Summary'!$P$8:$P$50,MATCH(Refrigeration!$B$50,'Savings Summary'!$C$8:$C$50,0))*D54+\nINDEX('Savings Summary'!$N$8:$N$50,MATCH(Refrigeration!$B$50,'Savings Summary'!$C$8:$C$50,0))*B54+\nINDEX('Savings Summary'!$O$8:$O$50,MATCH(Refrigeration!$B$50,'Savings Summary'!$C$8:$C$50,0))*C54,0),2)","v":0}]
["HIDE",{"$f":"ROUND(IFERROR(IF(COUNTA(H55:J55)<3,0,INDEX('Lookup tables'!$G$45:$G$60,IF(Refrigeration!I55=\"Freezer\",8,0)+IF(Refrigeration!J55=\"Glass\",4,0)+MATCH(H55,'Lookup tables'!$E$45:$E$48,1))),0)*F55,3)","v":0},{"$f":"ROUND(IFERROR(D55/8760*NCFr,0),3)","v":0},{"$f":"ROUND(IFERROR(IF(COUNTA(H55:J55)<3,0,INDEX('Lookup tables'!$F$45:$F$60,IF(Refrigeration!I55=\"Freezer\",8,0)+IF(Refrigeration!J55=\"Glass\",4,0)+MATCH(H55,'Lookup tables'!$E$45:$E$48,1))),0)*F55,0)","v":0},{"$f":"ROUND(IFERROR(INDEX('Savings Summary'!$P$8:$P$50,MATCH(Refrigeration!$B$50,'Savings Summary'!$C$8:$C$50,0))*D55+\nINDEX('Savings Summary'!$N$8:$N$50,MATCH(Refrigeration!$B$50,'Savings Summary'!$C$8:$C$50,0))*B55+\nINDEX('Savings Summary'!$O$8:$O$50,MATCH(Refrigeration!$B$50,'Savings Summary'!$C$8:$C$50,0))*C55,0),2)","v":0}]
["HIDE",{"$f":"ROUND(IFERROR(IF(COUNTA(H56:J56)<3,0,INDEX('Lookup tables'!$G$45:$G$60,IF(Refrigeration!I56=\"Freezer\",8,0)+IF(Refrigeration!J56=\"Glass\",4,0)+MATCH(H56,'Lookup tables'!$E$45:$E$48,1))),0)*F56,3)","v":0},{"$f":"ROUND(IFERROR(D56/8760*NCFr,0),3)","v":0},{"$f":"ROUND(IFERROR(IF(COUNTA(H56:J56)<3,0,INDEX('Lookup tables'!$F$45:$F$60,IF(Refrigeration!I56=\"Freezer\",8,0)+IF(Refrigeration!J56=\"Glass\",4,0)+MATCH(H56,'Lookup tables'!$E$45:$E$48,1))),0)*F56,0)","v":0},{"$f":"ROUND(IFERROR(INDEX('Savings Summary'!$P$8:$P$50,MATCH(Refrigeration!$B$50,'Savings Summary'!$C$8:$C$50,0))*D56+\nINDEX('Savings Summary'!$N$8:$N$50,MATCH(Refrigeration!$B$50,'Savings Summary'!$C$8:$C$50,0))*B56+\nINDEX('Savings Summary'!$O$8:$O$50,MATCH(Refrigeration!$B$50,'Savings Summary'!$C$8:$C$50,0))*C56,0),2)","v":0}]
["HIDE",{"$f":"SUM(B52:B56)","v":0},{"$f":"SUM(C52:C56)","v":0},{"$f":"SUM(D52:D56)","v":0},{"$f":"SUM(E52:E56)","v":0}]
[null,"Strip Curtains for Walk-In Refrigerated Storage"]
["HIDE","Peak kW","NC kW","kWh","Uncapped Incentive","Number of Doorways","Refrigeration Temperature","Facility Type"]
["HIDE",{"$f":"ROUND(IFERROR(INDEX('Lookup tables'!$E$95:$E$102,MATCH(Refrigeration!H60&Refrigeration!G60,'Lookup tables'!$D$95:$D$102,0))*$F60,0),3)","v":0},{"$f":"ROUND(IFERROR(INDEX('Lookup tables'!$F$95:$F$102,MATCH(Refrigeration!H60&Refrigeration!G60,'Lookup tables'!$D$95:$D$102,0))*$F60,0),3)","v":0},{"$f":"ROUND(IFERROR(INDEX('Lookup tables'!$G$95:$G$102,MATCH(Refrigeration!H60&Refrigeration!G60,'Lookup tables'!$D$95:$D$102,0))*$F60,0),0)","v":0},{"$f":"ROUND(IFERROR(INDEX('Savings Summary'!$P$8:$P$50,MATCH(Refrigeration!$B$58,'Savings Summary'!$C$8:$C$50,0))*D60+\nINDEX('Savings Summary'!$N$8:$N$50,MATCH(Refrigeration!$B$58,'Savings Summary'!$C$8:$C$50,0))*B60+\nINDEX('Savings Summary'!$O$8:$O$50,MATCH(Refrigeration!$B$58,'Savings Summary'!$C$8:$C$50,0))*C60,0),2)","v":0}]
["HIDE",{"$f":"ROUND(IFERROR(INDEX('Lookup tables'!$E$95:$E$102,MATCH(Refrigeration!H61&Refrigeration!G61,'Lookup tables'!$D$95:$D$102,0))*$F61,0),3)","v":0},{"$f":"ROUND(IFERROR(INDEX('Lookup tables'!$F$95:$F$102,MATCH(Refrigeration!H61&Refrigeration!G61,'Lookup tables'!$D$95:$D$102,0))*$F61,0),3)","v":0},{"$f":"ROUND(IFERROR(INDEX('Lookup tables'!$G$95:$G$102,MATCH(Refrigeration!H61&Refrigeration!G61,'Lookup tables'!$D$95:$D$102,0))*$F61,0),0)","v":0},{"$f":"ROUND(IFERROR(INDEX('Savings Summary'!$P$8:$P$50,MATCH(Refrigeration!$B$58,'Savings Summary'!$C$8:$C$50,0))*D61+\nINDEX('Savings Summary'!$N$8:$N$50,MATCH(Refrigeration!$B$58,'Savings Summary'!$C$8:$C$50,0))*B61+\nINDEX('Savings Summary'!$O$8:$O$50,MATCH(Refrigeration!$B$58,'Savings Summary'!$C$8:$C$50,0))*C61,0),2)","v":0}]
["HIDE",{"$f":"ROUND(IFERROR(INDEX('Lookup tables'!$E$95:$E$102,MATCH(Refrigeration!H62&Refrigeration!G62,'Lookup tables'!$D$95:$D$102,0))*$F62,0),3)","v":0},{"$f":"ROUND(IFERROR(INDEX('Lookup tables'!$F$95:$F$102,MATCH(Refrigeration!H62&Refrigeration!G62,'Lookup tables'!$D$95:$D$102,0))*$F62,0),3)","v":0},{"$f":"ROUND(IFERROR(INDEX('Lookup tables'!$G$95:$G$102,MATCH(Refrigeration!H62&Refrigeration!G62,'Lookup tables'!$D$95:$D$102,0))*$F62,0),0)","v":0},{"$f":"ROUND(IFERROR(INDEX('Savings Summary'!$P$8:$P$50,MATCH(Refrigeration!$B$58,'Savings Summary'!$C$8:$C$50,0))*D62+\nINDEX('Savings Summary'!$N$8:$N$50,MATCH(Refrigeration!$B$58,'Savings Summary'!$C$8:$C$50,0))*B62+\nINDEX('Savings Summary'!$O$8:$O$50,MATCH(Refrigeration!$B$58,'Savings Summary'!$C$8:$C$50,0))*C62,0),2)","v":0}]
["HIDE",{"$f":"SUM(B60:B62)","v":0},{"$f":"SUM(C60:C62)","v":0},{"$f":"SUM(D60:D62)","v":0},{"$f":"SUM(E60:E62)","v":0}]
[null,"Zero-Energy Doors for Refrigerated Cases"]
["HIDE","Peak kW","NC kW","kWh","Uncapped Incentive","Length of Case (ft)","Refrigeration Temperature","This measure cannot be used in conjunction with anti-sweat heat (ASH) controls."]
["HIDE",{"$f":"ROUND(IFERROR(F66*INDEX('Lookup tables'!$E$64:$G$76,MATCH(State&SelectedZone&Refrigeration!$G66,'Lookup tables'!$D$64:$D$76,0),MATCH(Refrigeration!B$65,'Lookup tables'!$E$63:$G$63,0)),0),3)","v":0},{"$f":"ROUND(IFERROR(F66*INDEX('Lookup tables'!$E$64:$G$75,MATCH(State&SelectedZone&Refrigeration!$G66,'Lookup tables'!$D$64:$D$75,0),MATCH(Refrigeration!C$65,'Lookup tables'!$E$63:$G$63,0)),0),3)","v":0},{"$f":"ROUND(IFERROR(F66*INDEX('Lookup tables'!$E$64:$G$75,MATCH(State&SelectedZone&Refrigeration!$G66,'Lookup tables'!$D$64:$D$75,0),MATCH(Refrigeration!D$65,'Lookup tables'!$E$63:$G$63,0)),0),0)","v":0},{"$f":"ROUND(IFERROR(INDEX('Savings Summary'!$P$8:$P$50,MATCH(Refrigeration!$B$64,'Savings Summary'!$C$8:$C$50,0))*D66+\nINDEX('Savings Summary'!$N$8:$N$50,MATCH(Refrigeration!$B$64,'Savings Summary'!$C$8:$C$50,0))*B66+\nINDEX('Savings Summary'!$O$8:$O$50,MATCH(Refrigeration!$B$64,'Savings Summary'!$C$8:$C$50,0))*C66,0),2)","v":0}]
["HIDE",{"$f":"ROUND(IFERROR(F67*INDEX('Lookup tables'!$E$64:$G$76,MATCH(State&SelectedZone&Refrigeration!$G67,'Lookup tables'!$D$64:$D$76,0),MATCH(Refrigeration!B$65,'Lookup tables'!$E$63:$G$63,0)),0),3)","v":0},{"$f":"ROUND(IFERROR(F67*INDEX('Lookup tables'!$E$64:$G$75,MATCH(State&SelectedZone&Refrigeration!$G67,'Lookup tables'!$D$64:$D$75,0),MATCH(Refrigeration!C$65,'Lookup tables'!$E$63:$G$63,0)),0),3)","v":0},{"$f":"ROUND(IFERROR(F67*INDEX('Lookup tables'!$E$64:$G$75,MATCH(State&SelectedZone&Refrigeration!$G67,'Lookup tables'!$D$64:$D$75,0),MATCH(Refrigeration!D$65,'Lookup tables'!$E$63:$G$63,0)),0),0)","v":0},{"$f":"ROUND(IFERROR(INDEX('Savings Summary'!$P$8:$P$50,MATCH(Refrigeration!$B$64,'Savings Summary'!$C$8:$C$50,0))*D67+\nINDEX('Savings Summary'!$N$8:$N$50,MATCH(Refrigeration!$B$64,'Savings Summary'!$C$8:$C$50,0))*B67+\nINDEX('Savings Summary'!$O$8:$O$50,MATCH(Refrigeration!$B$64,'Savings Summary'!$C$8:$C$50,0))*C67,0),2)","v":0}]
["HIDE",{"$f":"ROUND(IFERROR(F68*INDEX('Lookup tables'!$E$64:$G$76,MATCH(State&SelectedZone&Refrigeration!$G68,'Lookup tables'!$D$64:$D$76,0),MATCH(Refrigeration!B$65,'Lookup tables'!$E$63:$G$63,0)),0),3)","v":0},{"$f":"ROUND(IFERROR(F68*INDEX('Lookup tables'!$E$64:$G$75,MATCH(State&SelectedZone&Refrigeration!$G68,'Lookup tables'!$D$64:$D$75,0),MATCH(Refrigeration!C$65,'Lookup tables'!$E$63:$G$63,0)),0),3)","v":0},{"$f":"ROUND(IFERROR(F68*INDEX('Lookup tables'!$E$64:$G$75,MATCH(State&SelectedZone&Refrigeration!$G68,'Lookup tables'!$D$64:$D$75,0),MATCH(Refrigeration!D$65,'Lookup tables'!$E$63:$G$63,0)),0),0)","v":0},{"$f":"ROUND(IFERROR(INDEX('Savings Summary'!$P$8:$P$50,MATCH(Refrigeration!$B$64,'Savings Summary'!$C$8:$C$50,0))*D68+\nINDEX('Savings Summary'!$N$8:$N$50,MATCH(Refrigeration!$B$64,'Savings Summary'!$C$8:$C$50,0))*B68+\nINDEX('Savings Summary'!$O$8:$O$50,MATCH(Refrigeration!$B$64,'Savings Summary'!$C$8:$C$50,0))*C68,0),2)","v":0}]
["HIDE",{"$f":"SUM(B66:B68)","v":0},{"$f":"SUM(C66:C68)","v":0},{"$f":"SUM(D66:D68)","v":0},{"$f":"SUM(E66:E68)","v":0}]
[null,"Vending Machine Controls"]
["HIDE","Peak kW","NC kW","kWh","Uncapped Incentive","Number of Machines","Type of Machine"]
["HIDE",{"$f":"ROUND(IFERROR(INDEX('Lookup tables'!G$228:L$230,MATCH(Refrigeration!G72,Vending,0),MATCH(State&SelectedZone,'Lookup tables'!G$227:L$227,0))*F72,0),3)","v":0},{"$f":"ROUND(IFERROR(INDEX('Lookup tables'!F$228:F$230,MATCH(Refrigeration!G72,Vending,0))*F72,0),3)","v":0},{"$f":"ROUND(IFERROR(INDEX('Lookup tables'!E$228:E$230,MATCH(Refrigeration!G72,Vending,0))*F72,0),0)","v":0},{"$f":"ROUND(IFERROR(INDEX('Savings Summary'!$P$8:$P$50,MATCH(Refrigeration!$B$70,'Savings Summary'!$C$8:$C$50,0))*D72+\nINDEX('Savings Summary'!$N$8:$N$50,MATCH(Refrigeration!$B$70,'Savings Summary'!$C$8:$C$50,0))*B72+\nINDEX('Savings Summary'!$O$8:$O$50,MATCH(Refrigeration!$B$70,'Savings Summary'!$C$8:$C$50,0))*C72,0),2)","v":0}]
["HIDE",{"$f":"ROUND(IFERROR(INDEX('Lookup tables'!G$228:L$230,MATCH(Refrigeration!G73,Vending,0),MATCH(State&SelectedZone,'Lookup tables'!G$227:L$227,0))*F73,0),3)","v":0},{"$f":"ROUND(IFERROR(INDEX('Lookup tables'!F$228:F$230,MATCH(Refrigeration!G73,Vending,0))*F73,0),3)","v":0},{"$f":"ROUND(IFERROR(INDEX('Lookup tables'!E$228:E$230,MATCH(Refrigeration!G73,Vending,0))*F73,0),0)","v":0},{"$f":"ROUND(IFERROR(INDEX('Savings Summary'!$P$8:$P$50,MATCH(Refrigeration!$B$70,'Savings Summary'!$C$8:$C$50,0))*D73+\nINDEX('Savings Summary'!$N$8:$N$50,MATCH(Refrigeration!$B$70,'Savings Summary'!$C$8:$C$50,0))*B73+\nINDEX('Savings Summary'!$O$8:$O$50,MATCH(Refrigeration!$B$70,'Savings Summary'!$C$8:$C$50,0))*C73,0),2)","v":0}]
["HIDE",{"$f":"ROUND(IFERROR(INDEX('Lookup tables'!G$228:L$230,MATCH(Refrigeration!G74,Vending,0),MATCH(State&SelectedZone,'Lookup tables'!G$227:L$227,0))*F74,0),3)","v":0},{"$f":"ROUND(IFERROR(INDEX('Lookup tables'!F$228:F$230,MATCH(Refrigeration!G74,Vending,0))*F74,0),3)","v":0},{"$f":"ROUND(IFERROR(INDEX('Lookup tables'!E$228:E$230,MATCH(Refrigeration!G74,Vending,0))*F74,0),0)","v":0},{"$f":"ROUND(IFERROR(INDEX('Savings Summary'!$P$8:$P$50,MATCH(Refrigeration!$B$70,'Savings Summary'!$C$8:$C$50,0))*D74+\nINDEX('Savings Summary'!$N$8:$N$50,MATCH(Refrigeration!$B$70,'Savings Summary'!$C$8:$C$50,0))*B74+\nINDEX('Savings Summary'!$O$8:$O$50,MATCH(Refrigeration!$B$70,'Savings Summary'!$C$8:$C$50,0))*C74,0),2)","v":0}]
["HIDE",{"$f":"SUM(B72:B74)","v":0},{"$f":"SUM(C72:C74)","v":0},{"$f":"SUM(D72:D74)","v":0},{"$f":"SUM(E72:E74)","v":0}]
[null,"High Speed Doors for Cold Storage"]
["HIDE","Peak kW","NC kW","kWh","Uncapped Incentive","Number of Doors","Door Width (ft)","Door Height (ft)","Cold Room Temperature\n(choose closest option)","Is the other side of the door conditioned space?",null,"COP","EnergyFactor","Demand Factor"]
["HIDE",{"$f":"ROUND(IF(COUNTA(F78:J78)=5,IFERROR(G78*H78^1.5*N78/(L78*3412)*F78,0),0),3)","v":0},{"$f":"B78","v":0},{"$f":"ROUND(IF(COUNTA(F78:J78)=5,IFERROR(G78*H78^1.5*M78/(L78*3412)*F78,0),0),0)","v":0},{"$f":"ROUND(IFERROR(INDEX('Savings Summary'!$P$8:$P$50,MATCH(Refrigeration!$B$76,'Savings Summary'!$C$8:$C$50,0))*D78+\nINDEX('Savings Summary'!$N$8:$N$50,MATCH(Refrigeration!$B$76,'Savings Summary'!$C$8:$C$50,0))*B78+\nINDEX('Savings Summary'!$O$8:$O$50,MATCH(Refrigeration!$B$76,'Savings Summary'!$C$8:$C$50,0))*C78,0),2)","v":0},null,null,null,null,null,null,{"$f":"2.8","v":2.8},{"$f":"INDEX('Lookup tables'!$F$106:$I$112,IF(Refrigeration!$J78=\"Yes\",1,MATCH(State&SelectedZone,'Lookup tables'!$E$106:$E$112,0)),MATCH(Refrigeration!$I78,HighSpeedDoorColdRoomTemp,0))","v":{"$error":"#N/A"}},{"$f":"INDEX('Lookup tables'!$F$116:$I$122,IF(Refrigeration!$J78=\"Yes\",1,MATCH(State&SelectedZone,'Lookup tables'!$E$106:$E$112,0)),MATCH(Refrigeration!$I78,HighSpeedDoorColdRoomTemp,0))","v":{"$error":"#N/A"}}]
["HIDE",{"$f":"ROUND(IF(COUNTA(F79:J79)=5,IFERROR(G79*H79^1.5*N79/(L79*3412)*F79,0),0),3)","v":0},{"$f":"B79","v":0},{"$f":"ROUND(IF(COUNTA(F79:J79)=5,IFERROR(G79*H79^1.5*M79/(L79*3412)*F79,0),0),0)","v":0},{"$f":"ROUND(IFERROR(INDEX('Savings Summary'!$P$8:$P$50,MATCH(Refrigeration!$B$76,'Savings Summary'!$C$8:$C$50,0))*D79+\nINDEX('Savings Summary'!$N$8:$N$50,MATCH(Refrigeration!$B$76,'Savings Summary'!$C$8:$C$50,0))*B79+\nINDEX('Savings Summary'!$O$8:$O$50,MATCH(Refrigeration!$B$76,'Savings Summary'!$C$8:$C$50,0))*C79,0),2)","v":0},null,null,null,null,null,null,{"$f":"2.8","v":2.8},{"$f":"INDEX('Lookup tables'!$F$106:$I$112,IF(Refrigeration!$J79=\"Yes\",1,MATCH(State&SelectedZone,'Lookup tables'!$E$106:$E$112,0)),MATCH(Refrigeration!$I79,HighSpeedDoorColdRoomTemp,0))","v":{"$error":"#N/A"}},{"$f":"INDEX('Lookup tables'!$F$116:$I$122,IF(Refrigeration!$J79=\"Yes\",1,MATCH(State&SelectedZone,'Lookup tables'!$E$106:$E$112,0)),MATCH(Refrigeration!$I79,HighSpeedDoorColdRoomTemp,0))","v":{"$error":"#N/A"}}]
["HIDE",0,0,0,{"$f":"ROUND(IFERROR(INDEX('Savings Summary'!$P$8:$P$50,MATCH(Refrigeration!$B$76,'Savings Summary'!$C$8:$C$50,0))*D80+\nINDEX('Savings Summary'!$N$8:$N$50,MATCH(Refrigeration!$B$76,'Savings Summary'!$C$8:$C$50,0))*B80+\nINDEX('Savings Summary'!$O$8:$O$50,MATCH(Refrigeration!$B$76,'Savings Summary'!$C$8:$C$50,0))*C80,0),2)","v":0},null,null,null,null,null,null,2.8,{"$f":"INDEX('Lookup tables'!$F$106:$I$112,IF(Refrigeration!$J80=\"Yes\",1,MATCH(State&SelectedZone,'Lookup tables'!$E$106:$E$112,0)),MATCH(Refrigeration!$I80,HighSpeedDoorColdRoomTemp,0))","v":{"$error":"#N/A"}},{"$f":"INDEX('Lookup tables'!$F$116:$I$122,IF(Refrigeration!$J80=\"Yes\",1,MATCH(State&SelectedZone,'Lookup tables'!$E$106:$E$112,0)),MATCH(Refrigeration!$I80,HighSpeedDoorColdRoomTemp,0))","v":{"$error":"#N/A"}}]
["HIDE",{"$f":"SUM(B78:B80)","v":0},{"$f":"SUM(C78:C80)","v":0},{"$f":"SUM(D78:D80)","v":0},{"$f":"SUM(E78:E80)","v":0}]

{"sheet":"Food Service & DHW","index":5,"n_rows":100,"n_cols":25,"rows_kept":100,"cut":false,"hidden":false,"merged":[[99,2,99,10],[90,2,90,10],[91,2,92,10],[93,2,94,10],[95,2,96,10],[97,2,98,10],[52,14,53,14],[52,15,53,15],[93,1,94,1],[91,1,92,1],[97,1,98,1],[95,1,96,1],[15,8,15,9],[16,8,16,9],[17,8,17,9],[18,8,18,9],[52,13,53,13]]}
[null,"Commercial Food Service & Domestic Hot Water Measures",null,null,null,null,null,null,null,null,null,null,null,"HIDE","HIDE","HIDE","HIDE","HIDE","HIDE","HIDE","HIDE","HIDE","HIDE","HIDE"]
[null,"Click on headings to expand or collapse sections. Blue Peak kW values indicate winter peak."]
[null,"ENERGY STAR Electric Convection Oven"]
["HIDE","Peak kW","NC kW","kWh","Uncapped Incentive","Number of Ovens","Model #","Oven Size"]
["HIDE",{"$f":"ROUND(IFERROR(VLOOKUP(H5,'Lookup tables'!$D$126:$H$128,3,FALSE)*F5,0),3)","v":0},{"$f":"ROUND(IFERROR(VLOOKUP(H5,'Lookup tables'!$D$126:$H$128,4,FALSE)*F5,0),3)","v":0},{"$f":"ROUND(IFERROR(VLOOKUP(H5,'Lookup tables'!$D$126:$H$128,2,FALSE)*F5,0),0)","v":0},{"$f":"ROUND(IFERROR(INDEX('Savings Summary'!$P$8:$P$50,MATCH($B$3,'Savings Summary'!$C$8:$C$50,0))*D5+\nINDEX('Savings Summary'!$N$8:$N$50,MATCH($B$3,'Savings Summary'!$C$8:$C$50,0))*B5+\nINDEX('Savings Summary'!$O$8:$O$50,MATCH($B$3,'Savings Summary'!$C$8:$C$50,0))*C5,0),2)","v":0}]
["HIDE",{"$f":"ROUND(IFERROR(VLOOKUP(H6,'Lookup tables'!$D$126:$H$128,3,FALSE)*F6,0),3)","v":0},{"$f":"ROUND(IFERROR(VLOOKUP(H6,'Lookup tables'!$D$126:$H$128,4,FALSE)*F6,0),3)","v":0},{"$f":"ROUND(IFERROR(VLOOKUP(H6,'Lookup tables'!$D$126:$H$128,2,FALSE)*F6,0),0)","v":0},{"$f":"ROUND(IFERROR(INDEX('Savings Summary'!$P$8:$P$50,MATCH($B$3,'Savings Summary'!$C$8:$C$50,0))*D6+\nINDEX('Savings Summary'!$N$8:$N$50,MATCH($B$3,'Savings Summary'!$C$8:$C$50,0))*B6+\nINDEX('Savings Summary'!$O$8:$O$50,MATCH($B$3,'Savings Summary'!$C$8:$C$50,0))*C6,0),2)","v":0}]
["HIDE",{"$f":"ROUND(IFERROR(VLOOKUP(H7,'Lookup tables'!$D$126:$H$128,3,FALSE)*F7,0),3)","v":0},{"$f":"ROUND(IFERROR(VLOOKUP(H7,'Lookup tables'!$D$126:$H$128,4,FALSE)*F7,0),3)","v":0},{"$f":"ROUND(IFERROR(VLOOKUP(H7,'Lookup tables'!$D$126:$H$128,2,FALSE)*F7,0),0)","v":0},{"$f":"ROUND(IFERROR(INDEX('Savings Summary'!$P$8:$P$50,MATCH($B$3,'Savings Summary'!$C$8:$C$50,0))*D7+\nINDEX('Savings Summary'!$N$8:$N$50,MATCH($B$3,'Savings Summary'!$C$8:$C$50,0))*B7+\nINDEX('Savings Summary'!$O$8:$O$50,MATCH($B$3,'Savings Summary'!$C$8:$C$50,0))*C7,0),2)","v":0}]
["HIDE",{"$f":"SUM(B5:B7)","v":0},{"$f":"SUM(C5:C7)","v":0},{"$f":"SUM(D5:D7)","v":0},{"$f":"SUM(E5:E7)","v":0}]
[null,"ENERGY STAR Combination Oven"]
["HIDE","Peak kW","NC kW","kWh","Uncapped Incentive","Number of Ovens","Model #","Pan Capacity"]
["HIDE",{"$f":"ROUND(IFERROR(F11*INDEX('Lookup tables'!F$132:F$169,MATCH('Food Service & DHW'!H11,CombinationOvenPanCapacity,0)),0),3)","v":0},{"$f":"ROUND(IFERROR(F11*INDEX('Lookup tables'!G$132:G$169,MATCH('Food Service & DHW'!H11,CombinationOvenPanCapacity,0)),0),3)","v":0},{"$f":"ROUND(IFERROR(F11*INDEX('Lookup tables'!E$132:E$169,MATCH('Food Service & DHW'!H11,CombinationOvenPanCapacity,0)),0),0)","v":0},{"$f":"ROUND(IFERROR(INDEX('Savings Summary'!$P$8:$P$50,MATCH($B$9,'Savings Summary'!$C$8:$C$50,0))*D11+\nINDEX('Savings Summary'!$N$8:$N$50,MATCH($B$9,'Savings Summary'!$C$8:$C$50,0))*B11+\nINDEX('Savings Summary'!$O$8:$O$50,MATCH($B$9,'Savings Summary'!$C$8:$C$50,0))*C11,0),2)","v":0}]
["HIDE",{"$f":"ROUND(IFERROR(F12*INDEX('Lookup tables'!F$132:F$169,MATCH('Food Service & DHW'!H12,CombinationOvenPanCapacity,0)),0),3)","v":0},{"$f":"ROUND(IFERROR(F12*INDEX('Lookup tables'!G$132:G$169,MATCH('Food Service & DHW'!H12,CombinationOvenPanCapacity,0)),0),3)","v":0},{"$f":"ROUND(IFERROR(F12*INDEX('Lookup tables'!E$132:E$169,MATCH('Food Service & DHW'!H12,CombinationOvenPanCapacity,0)),0),0)","v":0},{"$f":"ROUND(IFERROR(INDEX('Savings Summary'!$P$8:$P$50,MATCH($B$9,'Savings Summary'!$C$8:$C$50,0))*D12+\nINDEX('Savings Summary'!$N$8:$N$50,MATCH($B$9,'Savings Summary'!$C$8:$C$50,0))*B12+\nINDEX('Savings Summary'!$O$8:$O$50,MATCH($B$9,'Savings Summary'!$C$8:$C$50,0))*C12,0),2)","v":0}]
["HIDE",{"$f":"ROUND(IFERROR(F13*INDEX('Lookup tables'!F$132:F$169,MATCH('Food Service & DHW'!H13,CombinationOvenPanCapacity,0)),0),3)","v":0},{"$f":"ROUND(IFERROR(F13*INDEX('Lookup tables'!G$132:G$169,MATCH('Food Service & DHW'!H13,CombinationOvenPanCapacity,0)),0),3)","v":0},{"$f":"ROUND(IFERROR(F13*INDEX('Lookup tables'!E$132:E$169,MATCH('Food Service & DHW'!H13,CombinationOvenPanCapacity,0)),0),0)","v":0},{"$f":"ROUND(IFERROR(INDEX('Savings Summary'!$P$8:$P$50,MATCH($B$9,'Savings Summary'!$C$8:$C$50,0))*D13+\nINDEX('Savings Summary'!$N$8:$N$50,MATCH($B$9,'Savings Summary'!$C$8:$C$50,0))*B13+\nINDEX('Savings Summary'!$O$8:$O$50,MATCH($B$9,'Savings Summary'!$C$8:$C$50,0))*C13,0),2)","v":0}]
["HIDE",{"$f":"SUM(B11:B13)","v":0},{"$f":"SUM(C11:C13)","v":0},{"$f":"SUM(D11:D13)","v":0},{"$f":"SUM(E11:E13)","v":0}]
[null,"ENERGY STAR Commercial Dishwashers",null,null,null,null,null,null,null,null,"Click for dishwasher type descriptions"]
["HIDE","Peak kW","NC kW","kWh","Uncapped Incentive","Number of Dishwashers","Model #","Dishwasher Type","Dishwasher Temperature/Supply",null,null,null,null,null,"Measure Life"]
["HIDE",{"$f":"ROUND(IFERROR($F17*INDEX('Lookup tables'!$E$176:$S$179,MATCH('Food Service & DHW'!$I17,'Lookup tables'!$D$176:$D$179,0),MATCH('Food Service & DHW'!$H17&'Food Service & DHW'!B$16,'Lookup tables'!$E$175:$S$175,0)),0),3)","v":0},{"$f":"ROUND(IFERROR($F17*INDEX('Lookup tables'!$E$176:$S$179,MATCH('Food Service & DHW'!$I17,'Lookup tables'!$D$176:$D$179,0),MATCH('Food Service & DHW'!$H17&'Food Service & DHW'!C$16,'Lookup tables'!$E$175:$S$175,0)),0),3)","v":0},{"$f":"ROUND(IFERROR($F17*INDEX('Lookup tables'!$E$176:$R$179,MATCH('Food Service & DHW'!$I17,'Lookup tables'!$D$176:$D$179,0),MATCH('Food Service & DHW'!$H17&'Food Service & DHW'!D$16,'Lookup tables'!$E$175:$S$175,0)),0),0)","v":0},{"$f":"ROUND(IFERROR(INDEX('Savings Summary'!$P$8:$P$50,MATCH($B$15,'Savings Summary'!$C$8:$C$50,0))*D17+\nINDEX('Savings Summary'!$N$8:$N$50,MATCH($B$15,'Savings Summary'!$C$8:$C$50,0))*B17+\nINDEX('Savings Summary'!$O$8:$O$50,MATCH($B$15,'Savings Summary'!$C$8:$C$50,0))*C17,0),2)","v":0},null,null,null,null,null,null,null,null,null,{"$f":"IFERROR(INDEX('Lookup tables'!$V$174:$V$178,MATCH('Food Service & DHW'!H17,'Lookup tables'!$U$174:$U$178,0)),0)","v":0}]
["HIDE",{"$f":"ROUND(IFERROR($F18*INDEX('Lookup tables'!$E$176:$S$179,MATCH('Food Service & DHW'!$I18,'Lookup tables'!$D$176:$D$179,0),MATCH('Food Service & DHW'!$H18&'Food Service & DHW'!B$16,'Lookup tables'!$E$175:$S$175,0)),0),3)","v":0},{"$f":"ROUND(IFERROR($F18*INDEX('Lookup tables'!$E$176:$S$179,MATCH('Food Service & DHW'!$I18,'Lookup tables'!$D$176:$D$179,0),MATCH('Food Service & DHW'!$H18&'Food Service & DHW'!C$16,'Lookup tables'!$E$175:$S$175,0)),0),3)","v":0},{"$f":"ROUND(IFERROR($F18*INDEX('Lookup tables'!$E$176:$R$179,MATCH('Food Service & DHW'!$I18,'Lookup tables'!$D$176:$D$179,0),MATCH('Food Service & DHW'!$H18&'Food Service & DHW'!D$16,'Lookup tables'!$E$175:$S$175,0)),0),0)","v":0},{"$f":"ROUND(IFERROR(INDEX('Savings Summary'!$P$8:$P$50,MATCH($B$15,'Savings Summary'!$C$8:$C$50,0))*D18+\nINDEX('Savings Summary'!$N$8:$N$50,MATCH($B$15,'Savings Summary'!$C$8:$C$50,0))*B18+\nINDEX('Savings Summary'!$O$8:$O$50,MATCH($B$15,'Savings Summary'!$C$8:$C$50,0))*C18,0),2)","v":0},null,null,null,null,null,null,null,null,null,{"$f":"IFERROR(INDEX('Lookup tables'!$V$174:$V$178,MATCH('Food Service & DHW'!H18,'Lookup tables'!$U$174:$U$178,0)),0)","v":0}]
["HIDE",{"$f":"ROUND(IFERROR($F19*INDEX('Lookup tables'!$E$176:$S$179,MATCH('Food Service & DHW'!$I19,'Lookup tables'!$D$176:$D$179,0),MATCH('Food Service & DHW'!$H19&'Food Service & DHW'!B$16,'Lookup tables'!$E$175:$S$175,0)),0),3)","v":0},{"$f":"ROUND(IFERROR($F19*INDEX('Lookup tables'!$E$176:$S$179,MATCH('Food Service & DHW'!$I19,'Lookup tables'!$D$176:$D$179,0),MATCH('Food Service & DHW'!$H19&'Food Service & DHW'!C$16,'Lookup tables'!$E$175:$S$175,0)),0),3)","v":0},{"$f":"ROUND(IFERROR($F19*INDEX('Lookup tables'!$E$176:$R$179,MATCH('Food Service & DHW'!$I19,'Lookup tables'!$D$176:$D$179,0),MATCH('Food Service & DHW'!$H19&'Food Service & DHW'!D$16,'Lookup tables'!$E$175:$S$175,0)),0),0)","v":0},{"$f":"ROUND(IFERROR(INDEX('Savings Summary'!$P$8:$P$50,MATCH($B$15,'Savings Summary'!$C$8:$C$50,0))*D19+\nINDEX('Savings Summary'!$N$8:$N$50,MATCH($B$15,'Savings Summary'!$C$8:$C$50,0))*B19+\nINDEX('Savings Summary'!$O$8:$O$50,MATCH($B$15,'Savings Summary'!$C$8:$C$50,0))*C19,0),2)","v":0},null,null,null,null,null,null,null,null,null,{"$f":"IFERROR(INDEX('Lookup tables'!$V$174:$V$178,MATCH('Food Service & DHW'!H19,'Lookup tables'!$U$174:$U$178,0)),0)","v":0}]
["HIDE",{"$f":"SUM(B17:B19)","v":0},{"$f":"SUM(C17:C19)","v":0},{"$f":"SUM(D17:D19)","v":0},{"$f":"SUM(E17:E19)","v":0},null,null,null,null,null,null,null,null,"Weighted Average:",{"$f":"ROUND(IFERROR(SUMPRODUCT(O17:O19,D17:D19)/SUM(D17:D19),10),1)","v":10}]
[null,"ENERGY STAR Electric Steam Cookers"]
["HIDE","Peak kW","NC kW","kWh","Uncapped Incentive","Number of Cookers","Model #","Number of Pans per Cooker","Steam Cooker Type"]
["HIDE",{"$f":"ROUND(IFERROR(INDEX('Lookup tables'!E197:G212,MATCH(TRM&I23&H23,'Lookup tables'!D197:D212,0),MATCH($B$22,'Lookup tables'!$E$196:$G$196,0))*F23,0),3)","v":0},{"$f":"ROUND(IFERROR(INDEX('Lookup tables'!E197:G212,MATCH(TRM&I23&H23,'Lookup tables'!D197:D212,0),MATCH($C$22,'Lookup tables'!$E$196:$G$196,0))*F23,0),3)","v":0},{"$f":"ROUND(IFERROR(INDEX('Lookup tables'!E197:G212,MATCH(TRM&I23&H23,'Lookup tables'!D197:D212,0),MATCH($D$22,'Lookup tables'!$E$196:$G$196,0))*F23,0),2)","v":0},{"$f":"ROUND(IFERROR(INDEX('Savings Summary'!$P$8:$P$50,MATCH($B$21,'Savings Summary'!$C$8:$C$50,0))*D23+\nINDEX('Savings Summary'!$N$8:$N$50,MATCH($B$21,'Savings Summary'!$C$8:$C$50,0))*B23+\nINDEX('Savings Summary'!$O$8:$O$50,MATCH($B$21,'Savings Summary'!$C$8:$C$50,0))*C23,0),2)","v":0}]
["HIDE",{"$f":"ROUND(IFERROR(INDEX('Lookup tables'!E198:G213,MATCH(TRM&I24&H24,'Lookup tables'!D198:D213,0),MATCH($B$22,'Lookup tables'!$E$196:$G$196,0))*F24,0),3)","v":0},{"$f":"ROUND(IFERROR(INDEX('Lookup tables'!E198:G213,MATCH(TRM&I24&H24,'Lookup tables'!D198:D213,0),MATCH($C$22,'Lookup tables'!$E$196:$G$196,0))*F24,0),3)","v":0},{"$f":"ROUND(IFERROR(INDEX('Lookup tables'!E198:G213,MATCH(TRM&I24&H24,'Lookup tables'!D198:D213,0),MATCH($D$22,'Lookup tables'!$E$196:$G$196,0))*F24,0),2)","v":0},{"$f":"ROUND(IFERROR(INDEX('Savings Summary'!$P$8:$P$50,MATCH($B$21,'Savings Summary'!$C$8:$C$50,0))*D24+\nINDEX('Savings Summary'!$N$8:$N$50,MATCH($B$21,'Savings Summary'!$C$8:$C$50,0))*B24+\nINDEX('Savings Summary'!$O$8:$O$50,MATCH($B$21,'Savings Summary'!$C$8:$C$50,0))*C24,0),2)","v":0}]
["HIDE",{"$f":"ROUND(IFERROR(INDEX('Lookup tables'!E199:G214,MATCH(TRM&I25&H25,'Lookup tables'!D199:D214,0),MATCH($B$22,'Lookup tables'!$E$196:$G$196,0))*F25,0),3)","v":0},{"$f":"ROUND(IFERROR(INDEX('Lookup tables'!E199:G214,MATCH(TRM&I25&H25,'Lookup tables'!D199:D214,0),MATCH($C$22,'Lookup tables'!$E$196:$G$196,0))*F25,0),3)","v":0},{"$f":"ROUND(IFERROR(INDEX('Lookup tables'!E199:G214,MATCH(TRM&I25&H25,'Lookup tables'!D199:D214,0),MATCH($D$22,'Lookup tables'!$E$196:$G$196,0))*F25,0),2)","v":0},{"$f":"ROUND(IFERROR(INDEX('Savings Summary'!$P$8:$P$50,MATCH($B$21,'Savings Summary'!$C$8:$C$50,0))*D25+\nINDEX('Savings Summary'!$N$8:$N$50,MATCH($B$21,'Savings Summary'!$C$8:$C$50,0))*B25+\nINDEX('Savings Summary'!$O$8:$O$50,MATCH($B$21,'Savings Summary'!$C$8:$C$50,0))*C25,0),2)","v":0}]
["HIDE",{"$f":"SUM(B23:B25)","v":0},{"$f":"SUM(C23:C25)","v":0},{"$f":"SUM(D23:D25)","v":0},{"$f":"SUM(E23:E25)","v":0}]
[null,"ENERGY STAR Electric Fryers"]
["HIDE","Peak kW","NC kW","kWh","Uncapped Incentive","Number of Fryers","Model #","Fryer Type"]
["HIDE",{"$f":"ROUND(IFERROR(INDEX('Lookup tables'!$E$222:$G$223,MATCH($H29,'Lookup tables'!$D$222:$D$223,0),2),0)*$F29,3)","v":0},{"$f":"ROUND(IFERROR(INDEX('Lookup tables'!$E$222:$G$223,MATCH($H29,'Lookup tables'!$D$222:$D$223,0),3),0)*$F29,3)","v":0},{"$f":"ROUND(IFERROR(INDEX('Lookup tables'!$E$222:$G$223,MATCH($H29,'Lookup tables'!$D$222:$D$223,0),1)*F29,0),2)","v":0},{"$f":"ROUND(IFERROR(INDEX('Savings Summary'!$P$8:$P$50,MATCH($B$27,'Savings Summary'!$C$8:$C$50,0))*D29+\nINDEX('Savings Summary'!$N$8:$N$50,MATCH($B$27,'Savings Summary'!$C$8:$C$50,0))*B29+\nINDEX('Savings Summary'!$O$8:$O$50,MATCH($B$27,'Savings Summary'!$C$8:$C$50,0))*C29,0),2)","v":0}]
["HIDE",{"$f":"ROUND(IFERROR(INDEX('Lookup tables'!$E$222:$G$223,MATCH($H30,'Lookup tables'!$D$222:$D$223,0),2),0)*$F30,3)","v":0},{"$f":"ROUND(IFERROR(INDEX('Lookup tables'!$E$222:$G$223,MATCH($H30,'Lookup tables'!$D$222:$D$223,0),3),0)*$F30,3)","v":0},{"$f":"ROUND(IFERROR(INDEX('Lookup tables'!$E$222:$G$223,MATCH($H30,'Lookup tables'!$D$222:$D$223,0),1)*F30,0),2)","v":0},{"$f":"ROUND(IFERROR(INDEX('Savings Summary'!$P$8:$P$50,MATCH($B$27,'Savings Summary'!$C$8:$C$50,0))*D30+\nINDEX('Savings Summary'!$N$8:$N$50,MATCH($B$27,'Savings Summary'!$C$8:$C$50,0))*B30+\nINDEX('Savings Summary'!$O$8:$O$50,MATCH($B$27,'Savings Summary'!$C$8:$C$50,0))*C30,0),2)","v":0}]
["HIDE",{"$f":"ROUND(IFERROR(INDEX('Lookup tables'!$E$222:$G$223,MATCH($H31,'Lookup tables'!$D$222:$D$223,0),2),0)*$F31,3)","v":0},{"$f":"ROUND(IFERROR(INDEX('Lookup tables'!$E$222:$G$223,MATCH($H31,'Lookup tables'!$D$222:$D$223,0),3),0)*$F31,3)","v":0},{"$f":"ROUND(IFERROR(INDEX('Lookup tables'!$E$222:$G$223,MATCH($H31,'Lookup tables'!$D$222:$D$223,0),1)*F31,0),2)","v":0},{"$f":"ROUND(IFERROR(INDEX('Savings Summary'!$P$8:$P$50,MATCH($B$27,'Savings Summary'!$C$8:$C$50,0))*D31+\nINDEX('Savings Summary'!$N$8:$N$50,MATCH($B$27,'Savings Summary'!$C$8:$C$50,0))*B31+\nINDEX('Savings Summary'!$O$8:$O$50,MATCH($B$27,'Savings Summary'!$C$8:$C$50,0))*C31,0),2)","v":0}]
["HIDE",{"$f":"SUM(B29:B31)","v":0},{"$f":"SUM(C29:C31)","v":0},{"$f":"SUM(D29:D31)","v":0},{"$f":"SUM(E29:E31)","v":0}]
[null,"ENERGY STAR Electric Hot Food Holding Cabinets"]
["HIDE","Peak kW","NC kW","kWh","Uncapped Incentive","Number of Cabinets","Model #","Cabinet Volume (ft3)"]
["HIDE",{"$f":"ROUND(IFERROR(INDEX('Lookup tables'!$E$216:$G$218,MATCH($H35,'Lookup tables'!$D$216:$D$218,0),2),0)*$F35,3)","v":0},{"$f":"ROUND(IFERROR(INDEX('Lookup tables'!$E$216:$G$218,MATCH($H35,'Lookup tables'!$D$216:$D$218,0),3),0)*$F35,3)","v":0},{"$f":"ROUND(IFERROR(INDEX('Lookup tables'!$E$216:$G$218,MATCH($H35,'Lookup tables'!$D$216:$D$218,0),1)*F35,0),0)","v":0},{"$f":"ROUND(IFERROR(INDEX('Savings Summary'!$P$8:$P$50,MATCH($B$33,'Savings Summary'!$C$8:$C$50,0))*D35+\nINDEX('Savings Summary'!$N$8:$N$50,MATCH($B$33,'Savings Summary'!$C$8:$C$50,0))*B35+\nINDEX('Savings Summary'!$O$8:$O$50,MATCH($B$33,'Savings Summary'!$C$8:$C$50,0))*C35,0),2)","v":0}]
["HIDE",{"$f":"ROUND(IFERROR(INDEX('Lookup tables'!$E$216:$G$218,MATCH($H36,'Lookup tables'!$D$216:$D$218,0),2),0)*$F36,3)","v":0},{"$f":"ROUND(IFERROR(INDEX('Lookup tables'!$E$216:$G$218,MATCH($H36,'Lookup tables'!$D$216:$D$218,0),3),0)*$F36,3)","v":0},{"$f":"ROUND(IFERROR(INDEX('Lookup tables'!$E$216:$G$218,MATCH($H36,'Lookup tables'!$D$216:$D$218,0),1)*F36,0),0)","v":0},{"$f":"ROUND(IFERROR(INDEX('Savings Summary'!$P$8:$P$50,MATCH($B$33,'Savings Summary'!$C$8:$C$50,0))*D36+\nINDEX('Savings Summary'!$N$8:$N$50,MATCH($B$33,'Savings Summary'!$C$8:$C$50,0))*B36+\nINDEX('Savings Summary'!$O$8:$O$50,MATCH($B$33,'Savings Summary'!$C$8:$C$50,0))*C36,0),2)","v":0}]
["HIDE",{"$f":"ROUND(IFERROR(INDEX('Lookup tables'!$E$216:$G$218,MATCH($H37,'Lookup tables'!$D$216:$D$218,0),2),0)*$F37,3)","v":0},{"$f":"ROUND(IFERROR(INDEX('Lookup tables'!$E$216:$G$218,MATCH($H37,'Lookup tables'!$D$216:$D$218,0),3),0)*$F37,3)","v":0},{"$f":"ROUND(IFERROR(INDEX('Lookup tables'!$E$216:$G$218,MATCH($H37,'Lookup tables'!$D$216:$D$218,0),1)*F37,0),0)","v":0},{"$f":"ROUND(IFERROR(INDEX('Savings Summary'!$P$8:$P$50,MATCH($B$33,'Savings Summary'!$C$8:$C$50,0))*D37+\nINDEX('Savings Summary'!$N$8:$N$50,MATCH($B$33,'Savings Summary'!$C$8:$C$50,0))*B37+\nINDEX('Savings Summary'!$O$8:$O$50,MATCH($B$33,'Savings Summary'!$C$8:$C$50,0))*C37,0),2)","v":0}]
["HIDE",{"$f":"SUM(B35:B37)","v":0},{"$f":"SUM(C35:C37)","v":0},{"$f":"SUM(D35:D37)","v":0},{"$f":"SUM(E35:E37)","v":0}]
[null,"Low Flow Pre-Rinse Spray Valve"]
["HIDE","Peak kW","NC kW","kWh","Uncapped Incentive","Quantity (#)","Building Type","Product Class","Installed Flow Rate (GPM)","Max Flow Rate (GPM)",null,null,null,"U","(TH-TC)","Days","CH","(CE/EffE)","PLS"]
["HIDE",{"$f":"ROUND(IF(I41=\"\",0,D41*S41/1000000),3)","v":0},{"$f":"B41","v":0},{"$f":"ROUND(IF(I41=\"\",0,$F41*IFERROR((J41-I41)*N41*P41*O41*Q41*R41,0)),0)","v":0},{"$f":"ROUND(IFERROR(INDEX('Savings Summary'!$P$8:$P$50,MATCH($B$39,'Savings Summary'!$C$8:$C$50,0))*D41+\nINDEX('Savings Summary'!$N$8:$N$50,MATCH($B$39,'Savings Summary'!$C$8:$C$50,0))*B41+\nINDEX('Savings Summary'!$O$8:$O$50,MATCH($B$39,'Savings Summary'!$C$8:$C$50,0))*C41,0),2)","v":0},null,null,null,null,{"$f":"IFERROR(INDEX('Lookup tables'!O$235:O$237,MATCH('Food Service & DHW'!H41,SprayValveProductClass,0)),\"-\")","v":"-"},null,1,1,{"$f":"INDEX('Lookup tables'!E$235:G$239,MATCH('Food Service & DHW'!G41,SprayValveBldg,0),1)","v":{"$error":"#N/A"}},{"$f":"140.5-71.4","v":69.099999999999994},{"$f":"INDEX('Lookup tables'!E$235:G$239,MATCH('Food Service & DHW'!G41,SprayValveBldg,0),2)","v":{"$error":"#N/A"}},{"$f":"8.33","v":8.33},{"$f":"0.00029308/1","v":2.9307999999999998E-4},{"$f":"INDEX('Lookup tables'!$G$235:$L$239,MATCH('Food Service & DHW'!G41,SprayValveBldg,0),MATCH(State&SelectedZone,'Lookup tables'!$G$234:$L$234,0))","v":{"$error":"#N/A"}}]
["HIDE",{"$f":"ROUND(IF(I42=\"\",0,D42*S42/1000000),3)","v":0},{"$f":"B42","v":0},{"$f":"ROUND(IF(I42=\"\",0,$F42*IFERROR((J42-I42)*N42*P42*O42*Q42*R42,0)),0)","v":0},{"$f":"ROUND(IFERROR(INDEX('Savings Summary'!$P$8:$P$50,MATCH($B$39,'Savings Summary'!$C$8:$C$50,0))*D42+\nINDEX('Savings Summary'!$N$8:$N$50,MATCH($B$39,'Savings Summary'!$C$8:$C$50,0))*B42+\nINDEX('Savings Summary'!$O$8:$O$50,MATCH($B$39,'Savings Summary'!$C$8:$C$50,0))*C42,0),2)","v":0},null,null,null,null,{"$f":"IFERROR(INDEX('Lookup tables'!O$235:O$237,MATCH('Food Service & DHW'!H42,SprayValveProductClass,0)),\"-\")","v":"-"},null,null,null,{"$f":"INDEX('Lookup tables'!E$235:G$239,MATCH('Food Service & DHW'!G42,SprayValveBldg,0),1)","v":{"$error":"#N/A"}},{"$f":"140.5-71.4","v":69.099999999999994},{"$f":"INDEX('Lookup tables'!E$235:G$239,MATCH('Food Service & DHW'!G42,SprayValveBldg,0),2)","v":{"$error":"#N/A"}},{"$f":"8.33","v":8.33},{"$f":"0.00029308/1","v":2.9307999999999998E-4},{"$f":"INDEX('Lookup tables'!$G$235:$L$239,MATCH('Food Service & DHW'!G42,SprayValveBldg,0),MATCH(State&SelectedZone,'Lookup tables'!$G$234:$L$234,0))","v":{"$error":"#N/A"}}]
["HIDE",0,0,0,{"$f":"ROUND(IFERROR(INDEX('Savings Summary'!$P$8:$P$50,MATCH($B$39,'Savings Summary'!$C$8:$C$50,0))*D43+\nINDEX('Savings Summary'!$N$8:$N$50,MATCH($B$39,'Savings Summary'!$C$8:$C$50,0))*B43+\nINDEX('Savings Summary'!$O$8:$O$50,MATCH($B$39,'Savings Summary'!$C$8:$C$50,0))*C43,0),2)","v":0},null,null,null,null,{"$f":"IFERROR(INDEX('Lookup tables'!O$235:O$237,MATCH('Food Service & DHW'!H43,SprayValveProductClass,0)),\"-\")","v":"-"},null,null,null,{"$f":"INDEX('Lookup tables'!E$235:G$239,MATCH('Food Service & DHW'!G43,SprayValveBldg,0),1)","v":{"$error":"#N/A"}},69.099999999999994,{"$f":"INDEX('Lookup tables'!E$235:G$239,MATCH('Food Service & DHW'!G43,SprayValveBldg,0),2)","v":{"$error":"#N/A"}},{"$f":"8.33","v":8.33},2.9307999999999998E-4,{"$f":"INDEX('Lookup tables'!$G$235:$L$239,MATCH('Food Service & DHW'!G43,SprayValveBldg,0),MATCH(State&SelectedZone,'Lookup tables'!$G$234:$L$234,0))","v":{"$error":"#N/A"}}]
["HIDE",{"$f":"SUM(B41:B43)","v":0},{"$f":"SUM(C41:C43)","v":0},{"$f":"SUM(D41:D43)","v":0},{"$f":"SUM(E41:E43)","v":0},"Eligibility Criteria:","·Must be electric water heating"]
[null,"Demand Controlled Kitchen Ventilation"]
["HIDE","Peak kW","NCP kW","kWh","Uncapped Incentive","Quantity (#)","Building Type","Exhaust Fan HP","Dedicated Make-Up Air Unit (MAU)?",null,null,null,null,"kWh/HP savings","Wntr kW/HP savings","Wntr kW","Sumr kW/HP","Sumr kW","Summer Peak?"]
["HIDE",{"$f":"ROUND(IFERROR(IF(S47,R47,P47),0),3)","v":0},{"$f":"B47","v":0},{"$f":"ROUND(IFERROR(F47*H47*N47,0),0)","v":0},{"$f":"ROUND(IFERROR(INDEX('Savings Summary'!$P$8:$P$50,MATCH($B$45,'Savings Summary'!$C$8:$C$50,0))*D47+\nINDEX('Savings Summary'!$N$8:$N$50,MATCH($B$45,'Savings Summary'!$C$8:$C$50,0))*B47+\nINDEX('Savings Summary'!$O$8:$O$50,MATCH($B$45,'Savings Summary'!$C$8:$C$50,0))*C47,0),2)","v":0},null,null,null,null,null,null,null,null,{"$f":"INDEX('Lookup tables'!$E$244:$J$267,MATCH(State&SelectedZone&$G47,'Lookup tables'!$D$244:$D$267,0),MATCH($I47,YesNo,0))","v":{"$error":"#N/A"}},{"$f":"INDEX('Lookup tables'!$E$244:$J$267,MATCH(State&SelectedZone&$G47,'Lookup tables'!$D$244:$D$267,0),MATCH($I47,YesNo,0)+2)","v":{"$error":"#N/A"}},{"$f":"IFERROR(O47*F47*H47,0)","v":0},{"$f":"INDEX('Lookup tables'!$E$244:$J$267,MATCH(State&SelectedZone&$G47,'Lookup tables'!$D$244:$D$267,0),MATCH($I47,YesNo,0)+4)","v":{"$error":"#N/A"}},{"$f":"IFERROR(F47*H47*Q47,0)","v":0},{"$f":"R47>=P47","v":true}]
["HIDE",{"$f":"ROUND(IFERROR(IF(S48,R48,P48),0),3)","v":0},{"$f":"B48","v":0},{"$f":"ROUND(IFERROR(F48*H48*N48,0),0)","v":0},{"$f":"ROUND(IFERROR(INDEX('Savings Summary'!$P$8:$P$50,MATCH($B$45,'Savings Summary'!$C$8:$C$50,0))*D48+\nINDEX('Savings Summary'!$N$8:$N$50,MATCH($B$45,'Savings Summary'!$C$8:$C$50,0))*B48+\nINDEX('Savings Summary'!$O$8:$O$50,MATCH($B$45,'Savings Summary'!$C$8:$C$50,0))*C48,0),2)","v":0},null,null,null,null,null,null,null,null,{"$f":"INDEX('Lookup tables'!$E$244:$J$267,MATCH(State&SelectedZone&$G48,'Lookup tables'!$D$244:$D$267,0),MATCH($I48,YesNo,0))","v":{"$error":"#N/A"}},{"$f":"INDEX('Lookup tables'!$E$244:$J$267,MATCH(State&SelectedZone&$G48,'Lookup tables'!$D$244:$D$267,0),MATCH($I48,YesNo,0)+2)","v":{"$error":"#N/A"}},{"$f":"IFERROR(O48*F48*H48,0)","v":0},{"$f":"INDEX('Lookup tables'!$E$244:$J$267,MATCH(State&SelectedZone&$G48,'Lookup tables'!$D$244:$D$267,0),MATCH($I48,YesNo,0)+4)","v":{"$error":"#N/A"}},{"$f":"IFERROR(F48*H48*Q48,0)","v":0},{"$f":"R48>=P48","v":true}]
["HIDE",0,{"$f":"B49","v":0},0,{"$f":"ROUND(IFERROR(INDEX('Savings Summary'!$P$8:$P$50,MATCH($B$45,'Savings Summary'!$C$8:$C$50,0))*D49+\nINDEX('Savings Summary'!$N$8:$N$50,MATCH($B$45,'Savings Summary'!$C$8:$C$50,0))*B49+\nINDEX('Savings Summary'!$O$8:$O$50,MATCH($B$45,'Savings Summary'!$C$8:$C$50,0))*C49,0),2)","v":0},null,null,null,null,null,null,null,null,{"$f":"INDEX('Lookup tables'!$E$244:$J$267,MATCH(State&SelectedZone&$G49,'Lookup tables'!$D$244:$D$267,0),MATCH($I49,YesNo,0))","v":{"$error":"#N/A"}},{"$f":"INDEX('Lookup tables'!$E$244:$J$267,MATCH(State&SelectedZone&$G49,'Lookup tables'!$D$244:$D$267,0),MATCH($I49,YesNo,0)+2)","v":{"$error":"#N/A"}},0,{"$f":"INDEX('Lookup tables'!$E$244:$J$267,MATCH(State&SelectedZone&$G49,'Lookup tables'!$D$244:$D$267,0),MATCH($I49,YesNo,0)+4)","v":{"$error":"#N/A"}},0,true]
["HIDE",0,0,0,{"$f":"ROUND(IFERROR(INDEX('Savings Summary'!$P$8:$P$50,MATCH($B$45,'Savings Summary'!$C$8:$C$50,0))*D50+\nINDEX('Savings Summary'!$N$8:$N$50,MATCH($B$45,'Savings Summary'!$C$8:$C$50,0))*B50+\nINDEX('Savings Summary'!$O$8:$O$50,MATCH($B$45,'Savings Summary'!$C$8:$C$50,0))*C50,0),2)","v":0},null,null,null,null,null,null,null,null,{"$f":"INDEX('Lookup tables'!$E$244:$J$267,MATCH(State&SelectedZone&$G50,'Lookup tables'!$D$244:$D$267,0),MATCH($I50,YesNo,0))","v":{"$error":"#N/A"}},{"$f":"INDEX('Lookup tables'!$E$244:$J$267,MATCH(State&SelectedZone&$G50,'Lookup tables'!$D$244:$D$267,0),MATCH($I50,YesNo,0)+2)","v":{"$error":"#N/A"}},0,{"$f":"INDEX('Lookup tables'!$E$244:$J$267,MATCH(State&SelectedZone&$G50,'Lookup tables'!$D$244:$D$267,0),MATCH($I50,YesNo,0)+4)","v":{"$error":"#N/A"}},0,true]
["HIDE",0,{"$f":"B51","v":0},0,{"$f":"ROUND(IFERROR(INDEX('Savings Summary'!$P$8:$P$50,MATCH($B$45,'Savings Summary'!$C$8:$C$50,0))*D51+\nINDEX('Savings Summary'!$N$8:$N$50,MATCH($B$45,'Savings Summary'!$C$8:$C$50,0))*B51+\nINDEX('Savings Summary'!$O$8:$O$50,MATCH($B$45,'Savings Summary'!$C$8:$C$50,0))*C51,0),2)","v":0},null,null,null,null,null,null,null,null,{"$f":"INDEX('Lookup tables'!$E$244:$J$267,MATCH(State&SelectedZone&$G51,'Lookup tables'!$D$244:$D$267,0),MATCH($I51,YesNo,0))","v":{"$error":"#N/A"}},{"$f":"INDEX('Lookup tables'!$E$244:$J$267,MATCH(State&SelectedZone&$G51,'Lookup tables'!$D$244:$D$267,0),MATCH($I51,YesNo,0)+2)","v":{"$error":"#N/A"}},0,{"$f":"INDEX('Lookup tables'!$E$244:$J$267,MATCH(State&SelectedZone&$G51,'Lookup tables'!$D$244:$D$267,0),MATCH($I51,YesNo,0)+4)","v":{"$error":"#N/A"}},0,true]
["HIDE",{"$f":"SUM(B47:B51)","v":0},{"$f":"SUM(C47:C51)","v":0},0,{"$f":"SUM(E47:E51)","v":0},null,null,null,null,null,null,null,null,null,null,{"$f":"SUM(P47:P51)","v":0},null,{"$f":"SUM(R47:R51)","v":0},{"$f":"R52>P52","v":false}]
[null,"ENERGY STAR Commercial Ice Makers",null,null,null,null,null,null,null,null,null,null,null,"Base Energy Use Const","Base Energy Use Mult","Use Rate Base (kWh/100 lb ice)"]
["HIDE","Peak kW","NCP kW","kWh","Uncapped Incentive","Quantity (#)","Model #","Type","Operation","Harvest Rate (lbs/day)","Energy Use (kWh/100 lbs ice)",null,null,null,null,null,"Duty Cycle","Days","PLS","kWh","kW"]
["HIDE",{"$f":"ROUND(U55,3)","v":0},{"$f":"ROUND(B55,3)","v":0},{"$f":"ROUND(T55,0)","v":0},{"$f":"ROUND(IFERROR(INDEX('Savings Summary'!$P$8:$P$50,MATCH($B$53,'Savings Summary'!$C$8:$C$50,0))*D55+\nINDEX('Savings Summary'!$N$8:$N$50,MATCH($B$53,'Savings Summary'!$C$8:$C$50,0))*B55+\nINDEX('Savings Summary'!$O$8:$O$50,MATCH($B$53,'Savings Summary'!$C$8:$C$50,0))*C55,0),2)","v":0},null,null,null,null,null,null,null,null,{"$f":"INDEX('Lookup tables'!$G$271:$G$291,MATCH(1,('Food Service & DHW'!H55='Lookup tables'!$D$271:$D$291)*('Food Service & DHW'!I55='Lookup tables'!$E$271:$E$291)*('Food Service & DHW'!J55<'Lookup tables'!$F$271:$F$291),0))","v":{"$error":"#N/A"}},{"$f":"INDEX('Lookup tables'!$H$271:$H$291,MATCH(1,('Food Service & DHW'!H55='Lookup tables'!$D$271:$D$291)*('Food Service & DHW'!I55='Lookup tables'!$E$271:$E$291)*('Food Service & DHW'!J55<'Lookup tables'!$F$271:$F$291),0))","v":{"$error":"#N/A"}},{"$f":"N55+J55*O55","v":{"$error":"#N/A"}},0.75,365,1.2E-4,{"$f":"IF(COUNTA(F55:K55)<6,0,F55*(P55-K55)*J55/100*Q55*R55)","v":0},{"$f":"T55*S55","v":0}]
["HIDE",{"$f":"ROUND(U56,3)","v":0},{"$f":"ROUND(B56,3)","v":0},{"$f":"ROUND(T56,0)","v":0},{"$f":"ROUND(IFERROR(INDEX('Savings Summary'!$P$8:$P$50,MATCH($B$53,'Savings Summary'!$C$8:$C$50,0))*D56+\nINDEX('Savings Summary'!$N$8:$N$50,MATCH($B$53,'Savings Summary'!$C$8:$C$50,0))*B56+\nINDEX('Savings Summary'!$O$8:$O$50,MATCH($B$53,'Savings Summary'!$C$8:$C$50,0))*C56,0),2)","v":0},null,null,null,null,null,null,null,null,{"$f":"INDEX('Lookup tables'!$G$271:$G$291,MATCH(1,('Food Service & DHW'!H56='Lookup tables'!$D$271:$D$291)*('Food Service & DHW'!I56='Lookup tables'!$E$271:$E$291)*('Food Service & DHW'!J56<'Lookup tables'!$F$271:$F$291),0))","v":{"$error":"#N/A"}},{"$f":"INDEX('Lookup tables'!$H$271:$H$291,MATCH(1,('Food Service & DHW'!H56='Lookup tables'!$D$271:$D$291)*('Food Service & DHW'!I56='Lookup tables'!$E$271:$E$291)*('Food Service & DHW'!J56<'Lookup tables'!$F$271:$F$291),0))","v":{"$error":"#N/A"}},{"$f":"N56+J56*O56","v":{"$error":"#N/A"}},0.75,365,1.2E-4,{"$f":"IF(COUNTA(F56:K56)<6,0,F56*(P56-K56)*J56/100*Q56*R56)","v":0},{"$f":"T56*S56","v":0}]
["HIDE",0,0,0,{"$f":"ROUND(IFERROR(INDEX('Savings Summary'!$P$8:$P$50,MATCH($B$53,'Savings Summary'!$C$8:$C$50,0))*D57+\nINDEX('Savings Summary'!$N$8:$N$50,MATCH($B$53,'Savings Summary'!$C$8:$C$50,0))*B57+\nINDEX('Savings Summary'!$O$8:$O$50,MATCH($B$53,'Savings Summary'!$C$8:$C$50,0))*C57,0),2)","v":0},null,null,null,null,null,null,null,null,{"$f":"INDEX('Lookup tables'!$G$271:$G$291,MATCH(1,('Food Service & DHW'!H57='Lookup tables'!$D$271:$D$291)*('Food Service & DHW'!I57='Lookup tables'!$E$271:$E$291)*('Food Service & DHW'!J57<'Lookup tables'!$F$271:$F$291),0))","v":{"$error":"#N/A"}},{"$f":"INDEX('Lookup tables'!$H$271:$H$291,MATCH(1,('Food Service & DHW'!H57='Lookup tables'!$D$271:$D$291)*('Food Service & DHW'!I57='Lookup tables'!$E$271:$E$291)*('Food Service & DHW'!J57<'Lookup tables'!$F$271:$F$291),0))","v":{"$error":"#N/A"}},{"$f":"N57+J57*O57","v":{"$error":"#N/A"}},0.75,365,1.2E-4,0,{"$f":"T57*S57","v":0}]
["HIDE",0,0,0,{"$f":"ROUND(IFERROR(INDEX('Savings Summary'!$P$8:$P$50,MATCH($B$53,'Savings Summary'!$C$8:$C$50,0))*D58+\nINDEX('Savings Summary'!$N$8:$N$50,MATCH($B$53,'Savings Summary'!$C$8:$C$50,0))*B58+\nINDEX('Savings Summary'!$O$8:$O$50,MATCH($B$53,'Savings Summary'!$C$8:$C$50,0))*C58,0),2)","v":0},null,null,null,null,null,null,null,null,{"$f":"INDEX('Lookup tables'!$G$271:$G$291,MATCH(1,('Food Service & DHW'!H58='Lookup tables'!$D$271:$D$291)*('Food Service & DHW'!I58='Lookup tables'!$E$271:$E$291)*('Food Service & DHW'!J58<'Lookup tables'!$F$271:$F$291),0))","v":{"$error":"#N/A"}},{"$f":"INDEX('Lookup tables'!$H$271:$H$291,MATCH(1,('Food Service & DHW'!H58='Lookup tables'!$D$271:$D$291)*('Food Service & DHW'!I58='Lookup tables'!$E$271:$E$291)*('Food Service & DHW'!J58<'Lookup tables'!$F$271:$F$291),0))","v":{"$error":"#N/A"}},{"$f":"N58+J58*O58","v":{"$error":"#N/A"}},0.75,365,1.2E-4,0,0]
["HIDE",0,0,0,{"$f":"ROUND(IFERROR(INDEX('Savings Summary'!$P$8:$P$50,MATCH($B$53,'Savings Summary'!$C$8:$C$50,0))*D59+\nINDEX('Savings Summary'!$N$8:$N$50,MATCH($B$53,'Savings Summary'!$C$8:$C$50,0))*B59+\nINDEX('Savings Summary'!$O$8:$O$50,MATCH($B$53,'Savings Summary'!$C$8:$C$50,0))*C59,0),2)","v":0},null,null,null,null,null,null,null,null,{"$f":"INDEX('Lookup tables'!$G$271:$G$291,MATCH(1,('Food Service & DHW'!H59='Lookup tables'!$D$271:$D$291)*('Food Service & DHW'!I59='Lookup tables'!$E$271:$E$291)*('Food Service & DHW'!J59<'Lookup tables'!$F$271:$F$291),0))","v":{"$error":"#N/A"}},{"$f":"INDEX('Lookup tables'!$H$271:$H$291,MATCH(1,('Food Service & DHW'!H59='Lookup tables'!$D$271:$D$291)*('Food Service & DHW'!I59='Lookup tables'!$E$271:$E$291)*('Food Service & DHW'!J59<'Lookup tables'!$F$271:$F$291),0))","v":{"$error":"#N/A"}},{"$f":"N59+J59*O59","v":{"$error":"#N/A"}},0.75,365,1.2E-4,0,0]
["HIDE",{"$f":"SUM(B55:B59)","v":0},{"$f":"SUM(C55:C59)","v":0},0,{"$f":"SUM(E55:E59)","v":0}]
[null,"Vacuum-Sealing & Packaging Machines"]
["HIDE","Peak kW","NCP kW","kWh","Uncapped Incentive","Quantity (#)","Machine Operation Style"]
["HIDE",{"$f":"ROUND(IF(G63=\"On-Demand\",F63*'Lookup tables'!F295,0),3)","v":0},{"$f":"B63","v":0},{"$f":"ROUND(IF(G63=\"On-Demand\",F63*'Lookup tables'!E295,0),0)","v":0},{"$f":"ROUND(IFERROR(INDEX('Savings Summary'!$P$8:$P$50,MATCH($B$61,'Savings Summary'!$C$8:$C$50,0))*D63+\nINDEX('Savings Summary'!$N$8:$N$50,MATCH($B$61,'Savings Summary'!$C$8:$C$50,0))*B63+\nINDEX('Savings Summary'!$O$8:$O$50,MATCH($B$61,'Savings Summary'!$C$8:$C$50,0))*C63,0),2)","v":0}]
["HIDE",{"$f":"B63","v":0},{"$f":"C63","v":0},{"$f":"D63","v":0},{"$f":"E63","v":0}]
[null,"Low Flow Faucet Aerators"]
["HIDE","Peak kW","NC kW","kWh","Uncapped Incentive","Quantity (#)","Building Type","Water Heater Type","Installed Flow Rate (gpm)*",null,null,null,"U","Days","P","WHEff","TS","kWh"]
["HIDE",{"$f":"ROUND(IF(OR(F67=\"\",G67=\"\",H67=\"\",I67=\"\"),0,F67*IFERROR(8.33*M67*(2.2-I67)*(105-Q67)*O67/P67/3412,0)),3)","v":0},{"$f":"B67","v":0},{"$f":"ROUND(IF(OR(F67=\"\",G67=\"\",H67=\"\",I67=\"\"),0,IFERROR(R67,0)),0)","v":0},{"$f":"ROUND(IFERROR(INDEX('Savings Summary'!$P$8:$P$50,MATCH($B$65,'Savings Summary'!$C$8:$C$50,0))*D67+\nINDEX('Savings Summary'!$N$8:$N$50,MATCH($B$65,'Savings Summary'!$C$8:$C$50,0))*B67+\nINDEX('Savings Summary'!$O$8:$O$50,MATCH($B$65,'Savings Summary'!$C$8:$C$50,0))*C67,0),2)","v":0},null,null,null,null,null,null,null,{"$f":"INDEX('Lookup tables'!E$730:E$736,MATCH('Food Service & DHW'!$G67,'Lookup tables'!$D$730:$D$736,0))","v":{"$error":"#N/A"}},{"$f":"INDEX('Lookup tables'!F$730:F$736,MATCH('Food Service & DHW'!$G67,'Lookup tables'!$D$730:$D$736,0))","v":{"$error":"#N/A"}},{"$f":"INDEX('Lookup tables'!G$730:G$736,MATCH('Food Service & DHW'!$G67,'Lookup tables'!$D$730:$D$736,0))","v":{"$error":"#N/A"}},{"$f":"INDEX(WaterHeaterEff,MATCH(H67,WaterHeaterType,0))","v":{"$error":"#N/A"}},{"$f":"'Lookup tables'!$F$726","v":77.2},{"$f":"F67*8.33*M67*(2.2-I67)*(105-Q67)*N67/P67/3412","v":{"$error":"#N/A"}}]
["HIDE",{"$f":"ROUND(IF(OR(F68=\"\",G68=\"\",H68=\"\",I68=\"\"),0,F68*IFERROR(8.33*M68*(2.2-I68)*(105-Q68)*O68/P68/3412,0)),3)","v":0},{"$f":"B68","v":0},{"$f":"ROUND(IF(OR(F68=\"\",G68=\"\",H68=\"\",I68=\"\"),0,IFERROR(R68,0)),0)","v":0},{"$f":"ROUND(IFERROR(INDEX('Savings Summary'!$P$8:$P$50,MATCH($B$65,'Savings Summary'!$C$8:$C$50,0))*D68+\nINDEX('Savings Summary'!$N$8:$N$50,MATCH($B$65,'Savings Summary'!$C$8:$C$50,0))*B68+\nINDEX('Savings Summary'!$O$8:$O$50,MATCH($B$65,'Savings Summary'!$C$8:$C$50,0))*C68,0),2)","v":0},null,null,null,null,null,null,null,{"$f":"INDEX('Lookup tables'!E$730:E$736,MATCH('Food Service & DHW'!$G68,'Lookup tables'!$D$730:$D$736,0))","v":{"$error":"#N/A"}},{"$f":"INDEX('Lookup tables'!F$730:F$736,MATCH('Food Service & DHW'!$G68,'Lookup tables'!$D$730:$D$736,0))","v":{"$error":"#N/A"}},{"$f":"INDEX('Lookup tables'!G$730:G$736,MATCH('Food Service & DHW'!$G68,'Lookup tables'!$D$730:$D$736,0))","v":{"$error":"#N/A"}},{"$f":"INDEX(WaterHeaterEff,MATCH(H68,WaterHeaterType,0))","v":{"$error":"#N/A"}},{"$f":"'Lookup tables'!$F$726","v":77.2},{"$f":"F68*8.33*M68*(2.2-I68)*(105-Q68)*N68/P68/3412","v":{"$error":"#N/A"}}]
["HIDE",0,{"$f":"B69","v":0},0,{"$f":"ROUND(IFERROR(INDEX('Savings Summary'!$P$8:$P$50,MATCH($B$65,'Savings Summary'!$C$8:$C$50,0))*D69+\nINDEX('Savings Summary'!$N$8:$N$50,MATCH($B$65,'Savings Summary'!$C$8:$C$50,0))*B69+\nINDEX('Savings Summary'!$O$8:$O$50,MATCH($B$65,'Savings Summary'!$C$8:$C$50,0))*C69,0),2)","v":0},null,null,null,null,null,null,null,{"$f":"INDEX('Lookup tables'!E$730:E$736,MATCH('Food Service & DHW'!$G69,'Lookup tables'!$D$730:$D$736,0))","v":{"$error":"#N/A"}},{"$f":"INDEX('Lookup tables'!F$730:F$736,MATCH('Food Service & DHW'!$G69,'Lookup tables'!$D$730:$D$736,0))","v":{"$error":"#N/A"}},{"$f":"INDEX('Lookup tables'!G$730:G$736,MATCH('Food Service & DHW'!$G69,'Lookup tables'!$D$730:$D$736,0))","v":{"$error":"#N/A"}},{"$f":"INDEX(WaterHeaterEff,MATCH(H69,WaterHeaterType,0))","v":{"$error":"#N/A"}},{"$f":"'Lookup tables'!$F$726","v":77.2},{"$f":"F69*8.33*M69*(2.2-I69)*(105-Q69)*N69/P69/3412","v":{"$error":"#N/A"}}]
["HIDE",{"$f":"SUM(B67:B69)","v":0},{"$f":"SUM(C67:C69)","v":0},{"$f":"SUM(D67:D69)","v":0},{"$f":"SUM(E67:E69)","v":0},null,null,null,"*1.5GPM maximum"]
[null,"Low Flow Showerheads"]
["HIDE","Peak kW","NC kW","kWh","Uncapped Incentive","Quantity (#)","Building Type","Water Heater Type","Installed Flow Rate (gpm)*",null,null,null,"Days","N","P","WHEff","TS","FHW","kWh"]
["HIDE",{"$f":"ROUND(IF(COUNTA(F73:I73)<4,0,F73*IFERROR(8.33*7.8*N73*(2.5-I73)*R73*(120-Q73)*O73/P73/3412,0)),3)","v":0},{"$f":"B73","v":0},{"$f":"ROUND(IF(COUNTA(F73:I73)<4,0,IFERROR(S73,0)),0)","v":0},{"$f":"ROUND(IFERROR(INDEX('Savings Summary'!$P$8:$P$50,MATCH($B$71,'Savings Summary'!$C$8:$C$50,0))*D73+\nINDEX('Savings Summary'!$N$8:$N$50,MATCH($B$71,'Savings Summary'!$C$8:$C$50,0))*B73+\nINDEX('Savings Summary'!$O$8:$O$50,MATCH($B$71,'Savings Summary'!$C$8:$C$50,0))*C73,0),2)","v":0},null,null,null,null,null,null,null,{"$f":"INDEX('Lookup tables'!E$739:E$743,MATCH('Food Service & DHW'!$G73,'Lookup tables'!$D$739:$D$743,0))","v":{"$error":"#N/A"}},{"$f":"INDEX('Lookup tables'!F$739:F$743,MATCH('Food Service & DHW'!$G73,'Lookup tables'!$D$739:$D$743,0))","v":{"$error":"#N/A"}},{"$f":"INDEX('Lookup tables'!G$739:G$743,MATCH('Food Service & DHW'!$G73,'Lookup tables'!$D$739:$D$743,0))","v":{"$error":"#N/A"}},{"$f":"INDEX(WaterHeaterEff,MATCH(H73,WaterHeaterType,0))","v":{"$error":"#N/A"}},{"$f":"'Lookup tables'!$F$726","v":77.2},{"$f":"'Lookup tables'!$I$740","v":{"$error":"#N/A"}},{"$f":"F73*8.33*7.8*N73*(2.5-I73)*R73*(120-Q73)*M73/P73/3412","v":{"$error":"#N/A"}}]
["HIDE",{"$f":"ROUND(IF(COUNTA(F74:I74)<4,0,F74*IFERROR(8.33*7.8*N74*(2.5-I74)*R74*(120-Q74)*O74/P74/3412,0)),3)","v":0},{"$f":"B74","v":0},{"$f":"ROUND(IF(COUNTA(F74:I74)<4,0,IFERROR(S74,0)),0)","v":0},{"$f":"ROUND(IFERROR(INDEX('Savings Summary'!$P$8:$P$50,MATCH($B$71,'Savings Summary'!$C$8:$C$50,0))*D74+\nINDEX('Savings Summary'!$N$8:$N$50,MATCH($B$71,'Savings Summary'!$C$8:$C$50,0))*B74+\nINDEX('Savings Summary'!$O$8:$O$50,MATCH($B$71,'Savings Summary'!$C$8:$C$50,0))*C74,0),2)","v":0},null,null,null,null,null,null,null,{"$f":"INDEX('Lookup tables'!E$739:E$743,MATCH('Food Service & DHW'!$G74,'Lookup tables'!$D$739:$D$743,0))","v":{"$error":"#N/A"}},{"$f":"INDEX('Lookup tables'!F$739:F$743,MATCH('Food Service & DHW'!$G74,'Lookup tables'!$D$739:$D$743,0))","v":{"$error":"#N/A"}},{"$f":"INDEX('Lookup tables'!G$739:G$743,MATCH('Food Service & DHW'!$G74,'Lookup tables'!$D$739:$D$743,0))","v":{"$error":"#N/A"}},{"$f":"INDEX(WaterHeaterEff,MATCH(H74,WaterHeaterType,0))","v":{"$error":"#N/A"}},{"$f":"'Lookup tables'!$F$726","v":77.2},{"$f":"'Lookup tables'!$I$740","v":{"$error":"#N/A"}},{"$f":"F74*8.33*7.8*N74*(2.5-I74)*R74*(120-Q74)*M74/P74/3412","v":{"$error":"#N/A"}}]
["HIDE",0,{"$f":"B75","v":0},0,{"$f":"ROUND(IFERROR(INDEX('Savings Summary'!$P$8:$P$50,MATCH($B$71,'Savings Summary'!$C$8:$C$50,0))*D75+\nINDEX('Savings Summary'!$N$8:$N$50,MATCH($B$71,'Savings Summary'!$C$8:$C$50,0))*B75+\nINDEX('Savings Summary'!$O$8:$O$50,MATCH($B$71,'Savings Summary'!$C$8:$C$50,0))*C75,0),2)","v":0},null,null,null,null,null,null,null,{"$f":"INDEX('Lookup tables'!E$739:E$743,MATCH('Food Service & DHW'!$G75,'Lookup tables'!$D$739:$D$743,0))","v":{"$error":"#N/A"}},{"$f":"INDEX('Lookup tables'!F$739:F$743,MATCH('Food Service & DHW'!$G75,'Lookup tables'!$D$739:$D$743,0))","v":{"$error":"#N/A"}},{"$f":"INDEX('Lookup tables'!G$739:G$743,MATCH('Food Service & DHW'!$G75,'Lookup tables'!$D$739:$D$743,0))","v":{"$error":"#N/A"}},{"$f":"INDEX(WaterHeaterEff,MATCH(H75,WaterHeaterType,0))","v":{"$error":"#N/A"}},{"$f":"'Lookup tables'!$F$726","v":77.2},{"$f":"'Lookup tables'!$I$740","v":{"$error":"#N/A"}},{"$f":"F75*8.33*7.8*N75*(2.5-I75)*R75*(120-Q75)*M75/P75/3412","v":{"$error":"#N/A"}}]
["HIDE",{"$f":"SUM(B73:B75)","v":0},{"$f":"SUM(C73:C75)","v":0},{"$f":"SUM(D73:D75)","v":0},{"$f":"SUM(E73:E75)","v":0},null,null,null,"*2GPM maximum"]
[null,"Temperature-Sensitive Restrictor Valves for Showers"]
["HIDE","Peak kW","NC kW","kWh","Uncapped Incentive","Quantity (#)","Configuration","Flowrate (GPM)\n(choose closest option)","Water Heater Type",null,null,null,"V saved","rho*Cp","TSavg","RE","Conv","kWh/ea","TS_sumr","CP_sumr","kW_sumr/ea","TS_wntr","CP_wntr","kW_wntr/ea","Summer Pk?"]
["HIDE",{"$f":"ROUND(IFERROR(F79*MAX(U79,X79),0),3)","v":0},{"$f":"B79","v":0},{"$f":"ROUND(IFERROR(F79*R79,0),0)","v":0},{"$f":"ROUND(IFERROR(INDEX('Savings Summary'!$P$8:$P$50,MATCH($B$77,'Savings Summary'!$C$8:$C$50,0))*D79+\nINDEX('Savings Summary'!$N$8:$N$50,MATCH($B$77,'Savings Summary'!$C$8:$C$50,0))*B79+\nINDEX('Savings Summary'!$O$8:$O$50,MATCH($B$77,'Savings Summary'!$C$8:$C$50,0))*C79,0),2)","v":0},null,null,null,null,null,null,null,{"$f":"INDEX('Lookup tables'!$E$746:$E$753,MATCH('Food Service & DHW'!$G79&'Food Service & DHW'!$H79,'Lookup tables'!$D$746:$D$753,0))","v":{"$error":"#N/A"}},{"$f":"8.33*1","v":8.33},{"$f":"INDEX('Lookup tables'!$H$746:$L$751,MATCH(State&SelectedZone,'Lookup tables'!$G$746:$G$751,0),1)","v":77.2},{"$f":"INDEX(WaterHeaterEff,MATCH(I79,WaterHeaterType,0))","v":{"$error":"#N/A"}},{"$f":"3412","v":3412},{"$f":"M79*N79*(120-O79)/(P79*Q79)","v":{"$error":"#N/A"}},{"$f":"INDEX('Lookup tables'!$H$746:$L$751,MATCH(State&SelectedZone,'Lookup tables'!$G$746:$G$751,0),2)","v":86.1},{"$f":"INDEX('Lookup tables'!$H$746:$L$751,MATCH(State&SelectedZone,'Lookup tables'!$G$746:$G$751,0),4)","v":3.7999999999999999E-2},{"$f":"IFERROR(M79*N79*(120-S79)/(P79*Q79*365)*T79,0)","v":0},{"$f":"INDEX('Lookup tables'!$H$746:$L$751,MATCH(State&SelectedZone,'Lookup tables'!$G$746:$G$751,0),3)","v":68.5},{"$f":"INDEX('Lookup tables'!$H$746:$L$751,MATCH(State&SelectedZone,'Lookup tables'!$G$746:$G$751,0),5)","v":6.8000000000000005E-2},{"$f":"IFERROR(M79*N79*(120-V79)/(P79*Q79*365)*W79,0)","v":0},{"$f":"U79>=X79","v":true}]
["HIDE",{"$f":"ROUND(IFERROR(F80*MAX(U80,X80),0),3)","v":0},{"$f":"B80","v":0},{"$f":"ROUND(IFERROR(F80*R80,0),0)","v":0},{"$f":"ROUND(IFERROR(INDEX('Savings Summary'!$P$8:$P$50,MATCH($B$77,'Savings Summary'!$C$8:$C$50,0))*D80+\nINDEX('Savings Summary'!$N$8:$N$50,MATCH($B$77,'Savings Summary'!$C$8:$C$50,0))*B80+\nINDEX('Savings Summary'!$O$8:$O$50,MATCH($B$77,'Savings Summary'!$C$8:$C$50,0))*C80,0),2)","v":0},null,null,null,null,null,null,null,{"$f":"INDEX('Lookup tables'!$E$746:$E$753,MATCH('Food Service & DHW'!$G80&'Food Service & DHW'!$H80,'Lookup tables'!$D$746:$D$753,0))","v":{"$error":"#N/A"}},{"$f":"8.33*1","v":8.33},{"$f":"INDEX('Lookup tables'!$H$746:$L$751,MATCH(State&SelectedZone,'Lookup tables'!$G$746:$G$751,0),1)","v":77.2},{"$f":"INDEX(WaterHeaterEff,MATCH(I80,WaterHeaterType,0))","v":{"$error":"#N/A"}},{"$f":"3412","v":3412},{"$f":"M80*N80*(120-O80)/(P80*Q80)","v":{"$error":"#N/A"}},{"$f":"INDEX('Lookup tables'!$H$746:$L$751,MATCH(State&SelectedZone,'Lookup tables'!$G$746:$G$751,0),2)","v":86.1},{"$f":"INDEX('Lookup tables'!$H$746:$L$751,MATCH(State&SelectedZone,'Lookup tables'!$G$746:$G$751,0),4)","v":3.7999999999999999E-2},{"$f":"IFERROR(M80*N80*(120-S80)/(P80*Q80*365)*T80,0)","v":0},{"$f":"INDEX('Lookup tables'!$H$746:$L$751,MATCH(State&SelectedZone,'Lookup tables'!$G$746:$G$751,0),3)","v":68.5},{"$f":"INDEX('Lookup tables'!$H$746:$L$751,MATCH(State&SelectedZone,'Lookup tables'!$G$746:$G$751,0),5)","v":6.8000000000000005E-2},{"$f":"IFERROR(M80*N80*(120-V80)/(P80*Q80*365)*W80,0)","v":0},{"$f":"U80>=X80","v":true}]
["HIDE",0,{"$f":"B81","v":0},0,{"$f":"ROUND(IFERROR(INDEX('Savings Summary'!$P$8:$P$50,MATCH($B$77,'Savings Summary'!$C$8:$C$50,0))*D81+\nINDEX('Savings Summary'!$N$8:$N$50,MATCH($B$77,'Savings Summary'!$C$8:$C$50,0))*B81+\nINDEX('Savings Summary'!$O$8:$O$50,MATCH($B$77,'Savings Summary'!$C$8:$C$50,0))*C81,0),2)","v":0},null,null,null,null,null,null,null,{"$f":"INDEX('Lookup tables'!$E$746:$E$753,MATCH('Food Service & DHW'!$G81&'Food Service & DHW'!$H81,'Lookup tables'!$D$746:$D$753,0))","v":{"$error":"#N/A"}},{"$f":"8.33*1","v":8.33},{"$f":"INDEX('Lookup tables'!$H$746:$L$751,MATCH(State&SelectedZone,'Lookup tables'!$G$746:$G$751,0),1)","v":77.2},{"$f":"INDEX(WaterHeaterEff,MATCH(I81,WaterHeaterType,0))","v":{"$error":"#N/A"}},{"$f":"3412","v":3412},{"$f":"M81*N81*(120-O81)/(P81*Q81)","v":{"$error":"#N/A"}},{"$f":"INDEX('Lookup tables'!$H$746:$L$751,MATCH(State&SelectedZone,'Lookup tables'!$G$746:$G$751,0),2)","v":86.1},{"$f":"INDEX('Lookup tables'!$H$746:$L$751,MATCH(State&SelectedZone,'Lookup tables'!$G$746:$G$751,0),4)","v":3.7999999999999999E-2},0,{"$f":"INDEX('Lookup tables'!$H$746:$L$751,MATCH(State&SelectedZone,'Lookup tables'!$G$746:$G$751,0),3)","v":68.5},{"$f":"INDEX('Lookup tables'!$H$746:$L$751,MATCH(State&SelectedZone,'Lookup tables'!$G$746:$G$751,0),5)","v":6.8000000000000005E-2},0,true]
["HIDE",{"$f":"SUM(B79:B81)","v":0},{"$f":"SUM(C79:C81)","v":0},{"$f":"SUM(D79:D81)","v":0},{"$f":"SUM(E79:E81)","v":0},null,null,null,null,null,null,null,null,null,null,null,null,null,null,null,{"$f":"SUMPRODUCT(U79:U81,F79:F81)","v":0},null,null,{"$f":"SUMPRODUCT(X79:X81,F79:F81)","v":0},{"$f":"U82>=X82","v":true}]
[null,"Central Domestic Hot Water (DHW) Controls",null,null,null,null,null,null,null,null,null,null,null,null,"Summer",null,null,"Winter"]
["HIDE","Peak kW","NCP kW","kWh","Uncapped Incentive","Building Type","Water Heater Type","Circulating Pump Size (watts)","# of Units Served",null,null,null,"kWh/pump","kWh/unit","kW/pump","kW/unit","kW Total","kW/pump","kW/unit","kW Total","Summer Pk?"]
["HIDE",{"$f":"ROUND(MAX(Q85,T85),3)","v":0},{"$f":"B85","v":0},{"$f":"ROUND(IFERROR(M85+N85*I85,0),0)","v":0},{"$f":"ROUND(IFERROR(INDEX('Savings Summary'!$P$8:$P$50,MATCH($B$83,'Savings Summary'!$C$8:$C$50,0))*D85+\nINDEX('Savings Summary'!$N$8:$N$50,MATCH($B$83,'Savings Summary'!$C$8:$C$50,0))*B85+\nINDEX('Savings Summary'!$O$8:$O$50,MATCH($B$83,'Savings Summary'!$C$8:$C$50,0))*C85,0),2)","v":0},null,null,null,null,null,null,null,{"$f":"INDEX('Lookup tables'!F$710:F$713,MATCH('Food Service & DHW'!H85,DHWPumpSize,0))","v":{"$error":"#N/A"}},{"$f":"INDEX('Lookup tables'!E$718:P$723,MATCH(State&SelectedZone,'Lookup tables'!D$718:D$723,0),MATCH('Food Service & DHW'!G85&'Food Service & DHW'!F85&\"kWh\",'Lookup tables'!E$717:P$717,0))","v":{"$error":"#N/A"}},{"$f":"INDEX('Lookup tables'!G$710:L$713,MATCH('Food Service & DHW'!H85,DHWPumpSize,0),MATCH(State&SelectedZone,'Lookup tables'!G$709:L$709,0))","v":{"$error":"#N/A"}},{"$f":"INDEX('Lookup tables'!E$718:P$723,MATCH(State&SelectedZone,'Lookup tables'!D$718:D$723,0),MATCH('Food Service & DHW'!G85&'Food Service & DHW'!F85&\"kWs\",'Lookup tables'!E$717:P$717,0))","v":{"$error":"#N/A"}},{"$f":"IFERROR(I85*P85+O85,0)","v":0},{"$f":"INDEX('Lookup tables'!M$710:R$713,MATCH('Food Service & DHW'!H85,DHWPumpSize,0),MATCH(State&SelectedZone,'Lookup tables'!G$709:L$709,0))","v":{"$error":"#N/A"}},{"$f":"INDEX('Lookup tables'!E$718:P$723,MATCH(State&SelectedZone,'Lookup tables'!D$718:D$723,0),MATCH('Food Service & DHW'!G85&'Food Service & DHW'!F85&\"kWw\",'Lookup tables'!E$717:P$717,0))","v":{"$error":"#N/A"}},{"$f":"IFERROR(I85*S85+R85,0)","v":0},{"$f":"Q85>=T85","v":true}]
["HIDE",{"$f":"ROUND(MAX(Q86,T86),3)","v":0},{"$f":"B86","v":0},{"$f":"ROUND(IFERROR(M86+N86*I86,0),0)","v":0},{"$f":"ROUND(IFERROR(INDEX('Savings Summary'!$P$8:$P$50,MATCH($B$83,'Savings Summary'!$C$8:$C$50,0))*D86+\nINDEX('Savings Summary'!$N$8:$N$50,MATCH($B$83,'Savings Summary'!$C$8:$C$50,0))*B86+\nINDEX('Savings Summary'!$O$8:$O$50,MATCH($B$83,'Savings Summary'!$C$8:$C$50,0))*C86,0),2)","v":0},null,null,null,null,null,null,null,{"$f":"INDEX('Lookup tables'!F$710:F$713,MATCH('Food Service & DHW'!H86,DHWPumpSize,0))","v":{"$error":"#N/A"}},{"$f":"INDEX('Lookup tables'!E$718:P$723,MATCH(State&SelectedZone,'Lookup tables'!D$718:D$723,0),MATCH('Food Service & DHW'!G86&'Food Service & DHW'!F86&\"kWh\",'Lookup tables'!E$717:P$717,0))","v":{"$error":"#N/A"}},{"$f":"INDEX('Lookup tables'!G$710:L$713,MATCH('Food Service & DHW'!H86,DHWPumpSize,0),MATCH(State&SelectedZone,'Lookup tables'!G$709:L$709,0))","v":{"$error":"#N/A"}},{"$f":"INDEX('Lookup tables'!E$718:P$723,MATCH(State&SelectedZone,'Lookup tables'!D$718:D$723,0),MATCH('Food Service & DHW'!G86&'Food Service & DHW'!F86&\"kWs\",'Lookup tables'!E$717:P$717,0))","v":{"$error":"#N/A"}},{"$f":"IFERROR(I86*P86+O86,0)","v":0},{"$f":"INDEX('Lookup tables'!M$710:R$713,MATCH('Food Service & DHW'!H86,DHWPumpSize,0),MATCH(State&SelectedZone,'Lookup tables'!G$709:L$709,0))","v":{"$error":"#N/A"}},{"$f":"INDEX('Lookup tables'!E$718:P$723,MATCH(State&SelectedZone,'Lookup tables'!D$718:D$723,0),MATCH('Food Service & DHW'!G86&'Food Service & DHW'!F86&\"kWw\",'Lookup tables'!E$717:P$717,0))","v":{"$error":"#N/A"}},{"$f":"IFERROR(I86*S86+R86,0)","v":0},{"$f":"Q86>=T86","v":true}]
["HIDE",0,0,0,{"$f":"ROUND(IFERROR(INDEX('Savings Summary'!$P$8:$P$50,MATCH($B$83,'Savings Summary'!$C$8:$C$50,0))*D87+\nINDEX('Savings Summary'!$N$8:$N$50,MATCH($B$83,'Savings Summary'!$C$8:$C$50,0))*B87+\nINDEX('Savings Summary'!$O$8:$O$50,MATCH($B$83,'Savings Summary'!$C$8:$C$50,0))*C87,0),2)","v":0},null,null,null,null,null,null,null,{"$f":"INDEX('Lookup tables'!F$710:F$713,MATCH('Food Service & DHW'!H87,DHWPumpSize,0))","v":{"$error":"#N/A"}},{"$f":"INDEX('Lookup tables'!E$718:P$723,MATCH(State&SelectedZone,'Lookup tables'!D$718:D$723,0),MATCH('Food Service & DHW'!G87&'Food Service & DHW'!F87&\"kWh\",'Lookup tables'!E$717:P$717,0))","v":{"$error":"#N/A"}},{"$f":"INDEX('Lookup tables'!G$710:L$713,MATCH('Food Service & DHW'!H87,DHWPumpSize,0),MATCH(State&SelectedZone,'Lookup tables'!G$709:L$709,0))","v":{"$error":"#N/A"}},{"$f":"INDEX('Lookup tables'!E$718:P$723,MATCH(State&SelectedZone,'Lookup tables'!D$718:D$723,0),MATCH('Food Service & DHW'!G87&'Food Service & DHW'!F87&\"kWs\",'Lookup tables'!E$717:P$717,0))","v":{"$error":"#N/A"}},{"$f":"IFERROR(I87*P87+O87,0)","v":0},{"$f":"INDEX('Lookup tables'!M$710:R$713,MATCH('Food Service & DHW'!H87,DHWPumpSize,0),MATCH(State&SelectedZone,'Lookup tables'!G$709:L$709,0))","v":{"$error":"#N/A"}},{"$f":"INDEX('Lookup tables'!E$718:P$723,MATCH(State&SelectedZone,'Lookup tables'!D$718:D$723,0),MATCH('Food Service & DHW'!G87&'Food Service & DHW'!F87&\"kWw\",'Lookup tables'!E$717:P$717,0))","v":{"$error":"#N/A"}},{"$f":"IFERROR(I87*S87+R87,0)","v":0},true]
["HIDE",0,0,0,{"$f":"ROUND(IFERROR(INDEX('Savings Summary'!$P$8:$P$50,MATCH($B$83,'Savings Summary'!$C$8:$C$50,0))*D88+\nINDEX('Savings Summary'!$N$8:$N$50,MATCH($B$83,'Savings Summary'!$C$8:$C$50,0))*B88+\nINDEX('Savings Summary'!$O$8:$O$50,MATCH($B$83,'Savings Summary'!$C$8:$C$50,0))*C88,0),2)","v":0},null,null,null,null,null,null,null,{"$f":"INDEX('Lookup tables'!F$710:F$713,MATCH('Food Service & DHW'!H88,DHWPumpSize,0))","v":{"$error":"#N/A"}},{"$f":"INDEX('Lookup tables'!E$718:P$723,MATCH(State&SelectedZone,'Lookup tables'!D$718:D$723,0),MATCH('Food Service & DHW'!G88&'Food Service & DHW'!F88&\"kWh\",'Lookup tables'!E$717:P$717,0))","v":{"$error":"#N/A"}},{"$f":"INDEX('Lookup tables'!G$710:L$713,MATCH('Food Service & DHW'!H88,DHWPumpSize,0),MATCH(State&SelectedZone,'Lookup tables'!G$709:L$709,0))","v":{"$error":"#N/A"}},{"$f":"INDEX('Lookup tables'!E$718:P$723,MATCH(State&SelectedZone,'Lookup tables'!D$718:D$723,0),MATCH('Food Service & DHW'!G88&'Food Service & DHW'!F88&\"kWs\",'Lookup tables'!E$717:P$717,0))","v":{"$error":"#N/A"}},{"$f":"IFERROR(I88*P88+O88,0)","v":0},{"$f":"INDEX('Lookup tables'!M$710:R$713,MATCH('Food Service & DHW'!H88,DHWPumpSize,0),MATCH(State&SelectedZone,'Lookup tables'!G$709:L$709,0))","v":{"$error":"#N/A"}},{"$f":"INDEX('Lookup tables'!E$718:P$723,MATCH(State&SelectedZone,'Lookup tables'!D$718:D$723,0),MATCH('Food Service & DHW'!G88&'Food Service & DHW'!F88&\"kWw\",'Lookup tables'!E$717:P$717,0))","v":{"$error":"#N/A"}},{"$f":"IFERROR(I88*S88+R88,0)","v":0},true]
["HIDE",{"$f":"SUM(B85:B88)","v":0},{"$f":"SUM(C85:C88)","v":0},{"$f":"SUM(D85:D88)","v":0},{"$f":"SUM(E85:E88)","v":0},null,null,null,null,null,null,null,null,null,null,null,{"$f":"SUM(Q85:Q88)","v":0},null,null,{"$f":"SUM(T85:T88)","v":0},true]
[]
["HIDE","Dishwasher Type","Equipment Description"]
["HIDE","Under Counter Dishwasher","A machine with overall height of 38\" or less, in which a rack of dishes remains stationary within the machine while being subjected to sequential wash and rinse sprays, and is designed to be installed under food preparation workspaces.  Under counter dishwashers can be either chemical or hot water sanitizing, with an internal booster heater for the latter.  For purposes of this specification, only those machines designed for wash cycles of 10 minutes or less can qualify for ENERGY STAR®."]
["HIDE"]
["HIDE","Stationary Rack, Single Tank, Door Type Dishwasher","A machine in which a rack of dishes remains stationary within the machine while subjected to sequential wash and rinse sprays.  This definition also applies to machines in which the rack revolves on an axis during the wash and rinse cycles.  Subcategories of stationary door type machines include:  single and multiple wash tank, double rack, pot, pan and utensil washers, chemical dump type and hooded wash compartment (\"hood type\").  Stationary rack, single tank, door type models are covered by this specification and can be either chemical or hot water sanitizing, with an internal or external booster heater for the latter."]
["HIDE"]
["HIDE","Single Tank Conveyor Dishwasher","A washing machine that employs a conveyor or similar mechanism to carry dishes through a series of wash and rinse sprays within the machine.  Specifically, a single tank conveyor machine has a tank for wash water followed by a final sanitizing rinse and does not have a pumped rinse tank. This type of machine may include a pre-washing section before the washing section.  Single tank conveyor dishwashers can either be chemical or hot water sanitizing, with an internal or external booster heater for the latter."]
["HIDE"]
["HIDE","Multiple Tank Conveyor Dishwasher","A conveyor type machine that has one or more tanks for wash water and one or more tanks for pumped rinse water, followed by a final sanitizing rinse.  This type of machine may include one more pre-washing sections before the washing section.  Multiple tank conveyor dishwashers can be either chemical or hot water sanitizing, with an internal or external hot water booster heater for the latter."]
["HIDE"]
["HIDE","Pot, Pan, and Utensil","A stationary rack, door type machine designed to clean and sanitize pots, pans, and kitchen utensils."]

{"sheet":"HVAC & Envelope","index":6,"n_rows":68,"n_cols":24,"rows_kept":68,"cut":false,"hidden":true,"merged":[[50,14,51,14],[35,6,35,7],[43,8,43,10],[50,13,51,13],[24,7,24,8],[25,7,25,8],[26,7,26,8],[27,7,27,8],[28,7,28,8],[34,7,34,8],[29,7,29,8],[30,7,30,8],[31,7,31,8],[32,7,32,8],[33,7,33,8],[55,8,55,10],[7,6,7,7],[7,9,7,10],[22,6,22,8],[22,9,22,10]]}
[null,"HVAC & Building Envelope Measures",null,null,null,null,null,null,null,null,null,null,"HIDE","HIDE","HIDE","HIDE","HIDE","HIDE","HIDE","HIDE","HIDE","HIDE","HIDE","HIDE"]
[null,"Click on headings to expand or collapse sections. Blue Peak kW values indicate winter peak."]
[null,"Cool Roofs"]
["HIDE","Peak kW","NCP kW","kWh","Uncapped Incentive","Building Type","Installed Roof Area Over Conditioned Space (sq ft)","Initial Solar Reflectance","3-Year Solar Reflectance","Baseline Insulation R-Value (or) Building Manufacture Year","Post-Retrofit Insulation R-Value",null,"Post Lookup","Pre R value","Post R value","Eligible?"]
["HIDE",{"$f":"ROUND(IFERROR(INDEX(INDIRECT(State&SelectedZone&SUBSTITUTE(SUBSTITUTE(F5,\" (\",\"\"),\")\",\"\")),MATCH(N5,PreRvalues,0),3+MATCH(O5,PreRvalues,0)),0)*G5,3)","v":0},{"$f":"B5","v":0},{"$f":"ROUND(IFERROR(INDEX(INDIRECT(State&SelectedZone&SUBSTITUTE(SUBSTITUTE(F5,\" (\",\"\"),\")\",\"\")),MATCH(N5,PreRvalues,0),MATCH(O5,PreRvalues,0)),0)*G5,0)","v":0},{"$f":"ROUND(IFERROR(INDEX('Savings Summary'!$P$8:$P$50,MATCH($B$3,'Savings Summary'!$C$8:$C$50,0))*D5+\nINDEX('Savings Summary'!$N$8:$N$50,MATCH($B$3,'Savings Summary'!$C$8:$C$50,0))*B5+\nINDEX('Savings Summary'!$O$8:$O$50,MATCH($B$3,'Savings Summary'!$C$8:$C$50,0))*C5,0),2)","v":0},null,null,null,null,null,null,null,{"$f":"INDEX('Lookup tables'!C$558:C$563,MATCH(J5,PreRvalues,0))","v":{"$error":"#N/A"}},{"$f":"IF(MATCH(J5,PreRvalues,0)<=3,J5,INDEX(PreRvalues,MATCH(J5,PreRvalues,0)-3))","v":{"$error":"#N/A"}},{"$f":"IF(OR(LEFT(K5,2)=\"No\",MATCH(J5,PreRvalues,0)>3),N5,K5)","v":{"$error":"#N/A"}},{"$f":"IF(H5<0.65,\"No\",IF(I5<0.5,\"No\",\"Yes\"))","v":"No"}]
["HIDE",{"$f":"ROUND(IFERROR(INDEX(INDIRECT(State&SelectedZone&SUBSTITUTE(SUBSTITUTE(F6,\" (\",\"\"),\")\",\"\")),MATCH(N6,PreRvalues,0),3+MATCH(O6,PreRvalues,0)),0)*G6,3)","v":0},{"$f":"B6","v":0},{"$f":"ROUND(IFERROR(INDEX(INDIRECT(State&SelectedZone&SUBSTITUTE(SUBSTITUTE(F6,\" (\",\"\"),\")\",\"\")),MATCH(N6,PreRvalues,0),MATCH(O6,PreRvalues,0)),0)*G6,0)","v":0},{"$f":"ROUND(IFERROR(INDEX('Savings Summary'!$P$8:$P$50,MATCH($B$3,'Savings Summary'!$C$8:$C$50,0))*D6+\nINDEX('Savings Summary'!$N$8:$N$50,MATCH($B$3,'Savings Summary'!$C$8:$C$50,0))*B6+\nINDEX('Savings Summary'!$O$8:$O$50,MATCH($B$3,'Savings Summary'!$C$8:$C$50,0))*C6,0),2)","v":0},null,null,null,null,null,null,null,{"$f":"INDEX('Lookup tables'!C$558:C$563,MATCH(J6,PreRvalues,0))","v":{"$error":"#N/A"}},{"$f":"IF(MATCH(J6,PreRvalues,0)<=3,J6,INDEX(PreRvalues,MATCH(J6,PreRvalues,0)-3))","v":{"$error":"#N/A"}},{"$f":"IF(OR(LEFT(K6,2)=\"No\",MATCH(J6,PreRvalues,0)>3),N6,K6)","v":{"$error":"#N/A"}},{"$f":"IF(H6<0.65,\"No\",IF(I6<0.5,\"No\",\"Yes\"))","v":"No"}]
["HIDE",{"$f":"ROUND(IFERROR(INDEX(INDIRECT(State&SelectedZone&SUBSTITUTE(SUBSTITUTE(F7,\" (\",\"\"),\")\",\"\")),MATCH(N7,PreRvalues,0),3+MATCH(O7,PreRvalues,0)),0)*G7,3)","v":0},0,{"$f":"ROUND(IFERROR(INDEX(INDIRECT(State&SelectedZone&SUBSTITUTE(SUBSTITUTE(F7,\" (\",\"\"),\")\",\"\")),MATCH(N7,PreRvalues,0),MATCH(O7,PreRvalues,0)),0)*G7,0)","v":0},{"$f":"ROUND(IFERROR(INDEX('Savings Summary'!$P$8:$P$50,MATCH($B$3,'Savings Summary'!$C$8:$C$50,0))*D7+\nINDEX('Savings Summary'!$N$8:$N$50,MATCH($B$3,'Savings Summary'!$C$8:$C$50,0))*B7+\nINDEX('Savings Summary'!$O$8:$O$50,MATCH($B$3,'Savings Summary'!$C$8:$C$50,0))*C7,0),2)","v":0},null,null,null,null,null,null,null,{"$f":"INDEX('Lookup tables'!C$558:C$563,MATCH(J7,PreRvalues,0))","v":{"$error":"#N/A"}},{"$f":"IF(MATCH(J7,PreRvalues,0)<=3,J7,INDEX(PreRvalues,MATCH(J7,PreRvalues,0)-3))","v":{"$error":"#N/A"}},{"$f":"IF(OR(LEFT(K7,2)=\"No\",MATCH(J7,PreRvalues,0)>3),N7,K7)","v":{"$error":"#N/A"}},{"$f":"IF(H7<0.65,\"No\",IF(I7<0.5,\"No\",\"Yes\"))","v":"No"}]
["HIDE",{"$f":"SUM(B5:B7)","v":0},{"$f":"SUM(C5:C7)","v":0},{"$f":"SUM(D5:D7)","v":0},{"$f":"SUM(E5:E7)","v":0},"Eligibility Criteria:","·Must be Low-Slope (2:12 or less)"]
[null,"Entrance & Exit Door Air Infiltration"]
["HIDE","Peak kW","NCP kW","kWh","Uncapped Incentive","Number of Doors* Sealed","Seal Type","Amount of Weather Stripping \n(ft per door)","Gap Width (inches)","Primary Heating Type",null,null,"Total ft","Cooling kWh/ft","Heating kWh/ft","Winter Peak savings","Summer Peak savings","NCP kW","Incentive","Summer Pk?"]
["HIDE",{"$f":"ROUND(MAX(P11:Q11),3)","v":0},{"$f":"ROUND(R11,3)","v":0},{"$f":"ROUND((N11+O11)*M11,0)","v":0},{"$f":"ROUND(_xlfn.IFNA(S11,IFERROR(INDEX('Savings Summary'!$P$8:$P$50,MATCH($B$9,'Savings Summary'!$C$8:$C$50,0))*D11+\nINDEX('Savings Summary'!$N$8:$N$50,MATCH($B$9,'Savings Summary'!$C$8:$C$50,0))*B11+\nINDEX('Savings Summary'!$O$8:$O$50,MATCH($B$9,'Savings Summary'!$C$8:$C$50,0))*C11,2)),2)","v":0},null,null,null,null,null,null,null,{"$f":"IF(G11=\"Door Sweep\",3,H11)*F11","v":0},{"$f":"IF(OR(I11=\"\",J11=\"\"),0,IFERROR(INDEX('Lookup tables'!$E$689:$AB$694,MATCH(State&SelectedZone,'Lookup tables'!$D$689:$D$694,0),MATCH(I11,DoorGap,0)),0))","v":0},{"$f":"IFERROR(IF(OR(J11=\"Gas or None\",J11=\"\",I11=\"\"),0,INDEX('Lookup tables'!$E$689:$AB$694,MATCH(State&SelectedZone,'Lookup tables'!$D$689:$D$694,0),IF(J11=\"Electric Resistance\",4,8)+MATCH(I11,DoorGap,0))),0)","v":0},{"$f":"IFERROR(IF(OR(J11=\"Gas or None\",J11=\"\",I11=\"\"),0,INDEX('Lookup tables'!$E$689:$AB$694,MATCH(State&SelectedZone,'Lookup tables'!$D$689:$D$694,0),IF(J11=\"Electric Resistance\",16,20)+MATCH(I11,DoorGap,0))),0)*M11","v":0},{"$f":"IF(OR(I11=\"\",J11=\"\"),0,IFERROR(INDEX('Lookup tables'!$E$689:$AB$694,MATCH(State&SelectedZone,'Lookup tables'!$D$689:$D$694,0),12+MATCH(I11,DoorGap,0)),0))*IF(G11=\"Door Sweep\",3,H11)*M11","v":0},{"$f":"IF(OR(I11=\"\",J11=\"\"),0,IFERROR(INDEX('Lookup tables'!$E$689:$AG$694,MATCH(State&SelectedZone,'Lookup tables'!$D$689:$D$694,0),24+MATCH(I11,DoorGap,0)),0))*M11","v":0},{"$f":"IF(D11=0,0,IF(G11=\"Door Sweep\",'Utility Admin'!$O$2,IF(G11=\"Weather Stripping\",'Utility Admin'!$P$2,0))*'HVAC & Envelope'!F11)","v":0},{"$f":"Q11>=P11","v":true}]
["HIDE",{"$f":"ROUND(MAX(P12:Q12),3)","v":0},{"$f":"ROUND(R12,3)","v":0},{"$f":"ROUND((N12+O12)*M12,0)","v":0},{"$f":"ROUND(_xlfn.IFNA(S12,IFERROR(INDEX('Savings Summary'!$P$8:$P$50,MATCH($B$9,'Savings Summary'!$C$8:$C$50,0))*D12+\nINDEX('Savings Summary'!$N$8:$N$50,MATCH($B$9,'Savings Summary'!$C$8:$C$50,0))*B12+\nINDEX('Savings Summary'!$O$8:$O$50,MATCH($B$9,'Savings Summary'!$C$8:$C$50,0))*C12,2)),2)","v":0},null,null,null,null,null,null,null,{"$f":"IF(G12=\"Door Sweep\",3,H12)*F12","v":0},{"$f":"IF(OR(I12=\"\",J12=\"\"),0,IFERROR(INDEX('Lookup tables'!$E$689:$AB$694,MATCH(State&SelectedZone,'Lookup tables'!$D$689:$D$694,0),MATCH(I12,DoorGap,0)),0))","v":0},{"$f":"IFERROR(IF(OR(J12=\"Gas or None\",J12=\"\",I12=\"\"),0,INDEX('Lookup tables'!$E$689:$AB$694,MATCH(State&SelectedZone,'Lookup tables'!$D$689:$D$694,0),IF(J12=\"Electric Resistance\",4,8)+MATCH(I12,DoorGap,0))),0)","v":0},{"$f":"IFERROR(IF(OR(J12=\"Gas or None\",J12=\"\",I12=\"\"),0,INDEX('Lookup tables'!$E$689:$AB$694,MATCH(State&SelectedZone,'Lookup tables'!$D$689:$D$694,0),IF(J12=\"Electric Resistance\",16,20)+MATCH(I12,DoorGap,0))),0)*M12","v":0},{"$f":"IF(OR(I12=\"\",J12=\"\"),0,IFERROR(INDEX('Lookup tables'!$E$689:$AB$694,MATCH(State&SelectedZone,'Lookup tables'!$D$689:$D$694,0),12+MATCH(I12,DoorGap,0)),0))*IF(G12=\"Door Sweep\",3,H12)*M12","v":0},{"$f":"IF(OR(I12=\"\",J12=\"\"),0,IFERROR(INDEX('Lookup tables'!$E$689:$AG$694,MATCH(State&SelectedZone,'Lookup tables'!$D$689:$D$694,0),24+MATCH(I12,DoorGap,0)),0))*M12","v":0},{"$f":"IF(D12=0,0,IF(G12=\"Door Sweep\",'Utility Admin'!$O$2,IF(G12=\"Weather Stripping\",'Utility Admin'!$P$2,0))*'HVAC & Envelope'!F12)","v":0},{"$f":"Q12>=P12","v":true}]
["HIDE",0,{"$f":"ROUND(R13,3)","v":0},{"$f":"ROUND((N13+O13)*M13,0)","v":0},{"$f":"ROUND(_xlfn.IFNA(S13,IFERROR(INDEX('Savings Summary'!$P$8:$P$50,MATCH($B$9,'Savings Summary'!$C$8:$C$50,0))*D13+\nINDEX('Savings Summary'!$N$8:$N$50,MATCH($B$9,'Savings Summary'!$C$8:$C$50,0))*B13+\nINDEX('Savings Summary'!$O$8:$O$50,MATCH($B$9,'Savings Summary'!$C$8:$C$50,0))*C13,2)),2)","v":0},null,null,null,null,null,null,null,{"$f":"IF(G13=\"Door Sweep\",3,H13)*F13","v":0},{"$f":"IF(OR(I13=\"\",J13=\"\"),0,IFERROR(INDEX('Lookup tables'!$E$689:$AB$694,MATCH(State&SelectedZone,'Lookup tables'!$D$689:$D$694,0),MATCH(I13,DoorGap,0)),0))","v":0},{"$f":"IFERROR(IF(OR(J13=\"Gas or None\",J13=\"\",I13=\"\"),0,INDEX('Lookup tables'!$E$689:$AB$694,MATCH(State&SelectedZone,'Lookup tables'!$D$689:$D$694,0),IF(J13=\"Electric Resistance\",4,8)+MATCH(I13,DoorGap,0))),0)","v":0},{"$f":"IFERROR(IF(OR(J13=\"Gas or None\",J13=\"\",I13=\"\"),0,INDEX('Lookup tables'!$E$689:$AB$694,MATCH(State&SelectedZone,'Lookup tables'!$D$689:$D$694,0),IF(J13=\"Electric Resistance\",16,20)+MATCH(I13,DoorGap,0))),0)*M13","v":0},{"$f":"IF(OR(I13=\"\",J13=\"\"),0,IFERROR(INDEX('Lookup tables'!$E$689:$AB$694,MATCH(State&SelectedZone,'Lookup tables'!$D$689:$D$694,0),12+MATCH(I13,DoorGap,0)),0))*IF(G13=\"Door Sweep\",3,H13)*M13","v":0},{"$f":"IF(OR(I13=\"\",J13=\"\"),0,IFERROR(INDEX('Lookup tables'!$E$689:$AG$694,MATCH(State&SelectedZone,'Lookup tables'!$D$689:$D$694,0),24+MATCH(I13,DoorGap,0)),0))*M13","v":0},{"$f":"IF(D13=0,0,IF(G13=\"Door Sweep\",'Utility Admin'!$O$2,IF(G13=\"Weather Stripping\",'Utility Admin'!$P$2,0))*'HVAC & Envelope'!F13)","v":0},true]
["HIDE",0,{"$f":"ROUND(R14,3)","v":0},0,{"$f":"ROUND(_xlfn.IFNA(S14,IFERROR(INDEX('Savings Summary'!$P$8:$P$50,MATCH($B$9,'Savings Summary'!$C$8:$C$50,0))*D14+\nINDEX('Savings Summary'!$N$8:$N$50,MATCH($B$9,'Savings Summary'!$C$8:$C$50,0))*B14+\nINDEX('Savings Summary'!$O$8:$O$50,MATCH($B$9,'Savings Summary'!$C$8:$C$50,0))*C14,2)),2)","v":0},null,null,null,null,null,null,null,{"$f":"IF(G14=\"Door Sweep\",3,H14)*F14","v":0},{"$f":"IF(OR(I14=\"\",J14=\"\"),0,IFERROR(INDEX('Lookup tables'!$E$689:$AB$694,MATCH(State&SelectedZone,'Lookup tables'!$D$689:$D$694,0),MATCH(I14,DoorGap,0)),0))","v":0},{"$f":"IFERROR(IF(OR(J14=\"Gas or None\",J14=\"\",I14=\"\"),0,INDEX('Lookup tables'!$E$689:$AB$694,MATCH(State&SelectedZone,'Lookup tables'!$D$689:$D$694,0),IF(J14=\"Electric Resistance\",4,8)+MATCH(I14,DoorGap,0))),0)","v":0},{"$f":"IFERROR(IF(OR(J14=\"Gas or None\",J14=\"\",I14=\"\"),0,INDEX('Lookup tables'!$E$689:$AB$694,MATCH(State&SelectedZone,'Lookup tables'!$D$689:$D$694,0),IF(J14=\"Electric Resistance\",16,20)+MATCH(I14,DoorGap,0))),0)*M14","v":0},{"$f":"IF(OR(I14=\"\",J14=\"\"),0,IFERROR(INDEX('Lookup tables'!$E$689:$AB$694,MATCH(State&SelectedZone,'Lookup tables'!$D$689:$D$694,0),12+MATCH(I14,DoorGap,0)),0))*IF(G14=\"Door Sweep\",3,H14)*M14","v":0},{"$f":"IF(OR(I14=\"\",J14=\"\"),0,IFERROR(INDEX('Lookup tables'!$E$689:$AG$694,MATCH(State&SelectedZone,'Lookup tables'!$D$689:$D$694,0),24+MATCH(I14,DoorGap,0)),0))*M14","v":0},{"$f":"IF(D14=0,0,IF(G14=\"Door Sweep\",'Utility Admin'!$O$2,IF(G14=\"Weather Stripping\",'Utility Admin'!$P$2,0))*'HVAC & Envelope'!F14)","v":0},true]
["HIDE",{"$f":"SUM(B11:B14)","v":0},{"$f":"SUM(C11:C14)","v":0},{"$f":"SUM(D11:D14)","v":0},{"$f":"SUM(E11:E14)","v":0},"*Double doors count as 2 doors.",null,null,null,null,null,null,null,null,null,{"$f":"SUM(P11:P14)","v":0},{"$f":"SUM(Q11:Q14)","v":0},null,{"$f":"SUM(S11:S14)","v":0},true]
[null,"Window Film Treatment"]
["HIDE","Peak kW","NCP kW","kWh","Uncapped Incentive","Area of Window Film (square feet)","Window Orientation","Existing Window Type","Post Shading Coefficient\n(from manufacturer specs)","HVAC Type","HVAC Installation Year",null,"SHG","SHGF","SHGF NCP","SCpre","SCpost","Conversion Factor (Btu/kW)","COP","kWh"]
["HIDE",{"$f":"ROUND(IFERROR(IF(I18=\"\",0,F18*N18*(P18-Q18)/(R18*S18)),0),3)","v":0},{"$f":"ROUND(IFERROR(IF(I18=\"\",0,F18*O18*(P18-Q18)/(R18*S18)),0),3)","v":0},{"$f":"ROUND(IFERROR(IF(I18=\"\",0,T18),0),0)","v":0},{"$f":"ROUND(IFERROR(INDEX('Savings Summary'!$P$8:$P$50,MATCH($B$16,'Savings Summary'!$C$8:$C$50,0))*D18+\nINDEX('Savings Summary'!$N$8:$N$50,MATCH($B$16,'Savings Summary'!$C$8:$C$50,0))*B18+\nINDEX('Savings Summary'!$O$8:$O$50,MATCH($B$16,'Savings Summary'!$C$8:$C$50,0))*C18,0),2)","v":0},null,null,null,null,null,null,null,{"$f":"VLOOKUP(G18,'Lookup tables'!$D$529:$E$537,2,FALSE)","v":{"$error":"#N/A"}},{"$f":"VLOOKUP(G18,'Lookup tables'!$D$529:$K$537,MATCH(State&SelectedZone,'Lookup tables'!$D$528:$K$528,0),FALSE)","v":{"$error":"#N/A"}},{"$f":"INDEX('Lookup tables'!L$529:L$537,MATCH('HVAC & Envelope'!G18,Orientation,0))","v":{"$error":"#N/A"}},{"$f":"INDEX('Lookup tables'!P$529:P$532,MATCH('HVAC & Envelope'!H18,WindowFilmExistingWindowType,0))","v":{"$error":"#N/A"}},{"$f":"I18","v":0},3413,{"$f":"INDEX('Lookup tables'!S$530:V$532,MATCH('HVAC & Envelope'!K18,WindowFilmConstruction,0),MATCH('HVAC & Envelope'!J18,WindowFilmHVACType,0))","v":{"$error":"#N/A"}},{"$f":"F18*M18*(P18-Q18)/(R18*S18)","v":{"$error":"#N/A"}}]
["HIDE",{"$f":"ROUND(IFERROR(IF(I19=\"\",0,F19*N19*(P19-Q19)/(R19*S19)),0),3)","v":0},{"$f":"ROUND(IFERROR(IF(I19=\"\",0,F19*O19*(P19-Q19)/(R19*S19)),0),3)","v":0},{"$f":"ROUND(IFERROR(IF(I19=\"\",0,T19),0),0)","v":0},{"$f":"ROUND(IFERROR(INDEX('Savings Summary'!$P$8:$P$50,MATCH($B$16,'Savings Summary'!$C$8:$C$50,0))*D19+\nINDEX('Savings Summary'!$N$8:$N$50,MATCH($B$16,'Savings Summary'!$C$8:$C$50,0))*B19+\nINDEX('Savings Summary'!$O$8:$O$50,MATCH($B$16,'Savings Summary'!$C$8:$C$50,0))*C19,0),2)","v":0},null,null,null,null,null,null,null,{"$f":"VLOOKUP(G19,'Lookup tables'!$D$529:$E$537,2,FALSE)","v":{"$error":"#N/A"}},{"$f":"VLOOKUP(G19,'Lookup tables'!$D$529:$K$537,MATCH(State&SelectedZone,'Lookup tables'!$D$528:$K$528,0),FALSE)","v":{"$error":"#N/A"}},{"$f":"INDEX('Lookup tables'!L$529:L$537,MATCH('HVAC & Envelope'!G19,Orientation,0))","v":{"$error":"#N/A"}},{"$f":"INDEX('Lookup tables'!P$529:P$532,MATCH('HVAC & Envelope'!H19,WindowFilmExistingWindowType,0))","v":{"$error":"#N/A"}},{"$f":"I19","v":0},3413,{"$f":"INDEX('Lookup tables'!S$530:V$532,MATCH('HVAC & Envelope'!K19,WindowFilmConstruction,0),MATCH('HVAC & Envelope'!J19,WindowFilmHVACType,0))","v":{"$error":"#N/A"}},{"$f":"F19*M19*(P19-Q19)/(R19*S19)","v":{"$error":"#N/A"}}]
["HIDE",{"$f":"ROUND(IFERROR(IF(I20=\"\",0,F20*N20*(P20-Q20)/(R20*S20)),0),3)","v":0},{"$f":"ROUND(IFERROR(IF(I20=\"\",0,F20*O20*(P20-Q20)/(R20*S20)),0),3)","v":0},{"$f":"ROUND(IFERROR(IF(I20=\"\",0,T20),0),0)","v":0},{"$f":"ROUND(IFERROR(INDEX('Savings Summary'!$P$8:$P$50,MATCH($B$16,'Savings Summary'!$C$8:$C$50,0))*D20+\nINDEX('Savings Summary'!$N$8:$N$50,MATCH($B$16,'Savings Summary'!$C$8:$C$50,0))*B20+\nINDEX('Savings Summary'!$O$8:$O$50,MATCH($B$16,'Savings Summary'!$C$8:$C$50,0))*C20,0),2)","v":0},null,null,null,null,null,null,null,{"$f":"VLOOKUP(G20,'Lookup tables'!$D$529:$E$537,2,FALSE)","v":{"$error":"#N/A"}},{"$f":"VLOOKUP(G20,'Lookup tables'!$D$529:$K$537,MATCH(State&SelectedZone,'Lookup tables'!$D$528:$K$528,0),FALSE)","v":{"$error":"#N/A"}},{"$f":"INDEX('Lookup tables'!L$529:L$537,MATCH('HVAC & Envelope'!G20,Orientation,0))","v":{"$error":"#N/A"}},{"$f":"INDEX('Lookup tables'!P$529:P$532,MATCH('HVAC & Envelope'!H20,WindowFilmExistingWindowType,0))","v":{"$error":"#N/A"}},{"$f":"I20","v":0},3413,{"$f":"INDEX('Lookup tables'!S$530:V$532,MATCH('HVAC & Envelope'!K20,WindowFilmConstruction,0),MATCH('HVAC & Envelope'!J20,WindowFilmHVACType,0))","v":{"$error":"#N/A"}},{"$f":"F20*M20*(P20-Q20)/(R20*S20)","v":{"$error":"#N/A"}}]
["HIDE",{"$f":"ROUND(IFERROR(IF(I21=\"\",0,F21*N21*(P21-Q21)/(R21*S21)),0),3)","v":0},{"$f":"ROUND(IFERROR(IF(I21=\"\",0,F21*O21*(P21-Q21)/(R21*S21)),0),3)","v":0},{"$f":"ROUND(IFERROR(IF(I21=\"\",0,T21),0),0)","v":0},{"$f":"ROUND(IFERROR(INDEX('Savings Summary'!$P$8:$P$50,MATCH($B$16,'Savings Summary'!$C$8:$C$50,0))*D21+\nINDEX('Savings Summary'!$N$8:$N$50,MATCH($B$16,'Savings Summary'!$C$8:$C$50,0))*B21+\nINDEX('Savings Summary'!$O$8:$O$50,MATCH($B$16,'Savings Summary'!$C$8:$C$50,0))*C21,0),2)","v":0},null,null,null,null,null,null,null,{"$f":"VLOOKUP(G21,'Lookup tables'!$D$529:$E$537,2,FALSE)","v":{"$error":"#N/A"}},{"$f":"VLOOKUP(G21,'Lookup tables'!$D$529:$K$537,MATCH(State&SelectedZone,'Lookup tables'!$D$528:$K$528,0),FALSE)","v":{"$error":"#N/A"}},{"$f":"INDEX('Lookup tables'!L$529:L$537,MATCH('HVAC & Envelope'!G21,Orientation,0))","v":{"$error":"#N/A"}},{"$f":"INDEX('Lookup tables'!P$529:P$532,MATCH('HVAC & Envelope'!H21,WindowFilmExistingWindowType,0))","v":{"$error":"#N/A"}},{"$f":"I21","v":0},3413,{"$f":"INDEX('Lookup tables'!S$530:V$532,MATCH('HVAC & Envelope'!K21,WindowFilmConstruction,0),MATCH('HVAC & Envelope'!J21,WindowFilmHVACType,0))","v":{"$error":"#N/A"}},{"$f":"F21*M21*(P21-Q21)/(R21*S21)","v":{"$error":"#N/A"}}]
["HIDE",{"$f":"ROUND(IFERROR(IF(I22=\"\",0,F22*N22*(P22-Q22)/(R22*S22)),0),3)","v":0},{"$f":"ROUND(IFERROR(IF(I22=\"\",0,F22*O22*(P22-Q22)/(R22*S22)),0),3)","v":0},{"$f":"ROUND(IFERROR(IF(I22=\"\",0,T22),0),0)","v":0},{"$f":"ROUND(IFERROR(INDEX('Savings Summary'!$P$8:$P$50,MATCH($B$16,'Savings Summary'!$C$8:$C$50,0))*D22+\nINDEX('Savings Summary'!$N$8:$N$50,MATCH($B$16,'Savings Summary'!$C$8:$C$50,0))*B22+\nINDEX('Savings Summary'!$O$8:$O$50,MATCH($B$16,'Savings Summary'!$C$8:$C$50,0))*C22,0),2)","v":0},null,null,null,null,null,null,null,{"$f":"VLOOKUP(G22,'Lookup tables'!$D$529:$E$537,2,FALSE)","v":{"$error":"#N/A"}},{"$f":"VLOOKUP(G22,'Lookup tables'!$D$529:$K$537,MATCH(State&SelectedZone,'Lookup tables'!$D$528:$K$528,0),FALSE)","v":{"$error":"#N/A"}},{"$f":"INDEX('Lookup tables'!L$529:L$537,MATCH('HVAC & Envelope'!G22,Orientation,0))","v":{"$error":"#N/A"}},{"$f":"INDEX('Lookup tables'!P$529:P$532,MATCH('HVAC & Envelope'!H22,WindowFilmExistingWindowType,0))","v":{"$error":"#N/A"}},{"$f":"I22","v":0},3413,{"$f":"INDEX('Lookup tables'!S$530:V$532,MATCH('HVAC & Envelope'!K22,WindowFilmConstruction,0),MATCH('HVAC & Envelope'!J22,WindowFilmHVACType,0))","v":{"$error":"#N/A"}},{"$f":"F22*M22*(P22-Q22)/(R22*S22)","v":{"$error":"#N/A"}}]
["HIDE",{"$f":"MAX(B18:B22)","v":0},{"$f":"MAX(C18:C22)","v":0},{"$f":"SUM(D18:D22)","v":0},{"$f":"SUM(E18:E22)","v":0},"Eligibility Criteria:","·Existing windows must have no solar films, solar screens, or interior shades\n·Must not be shaded by exterior awnings, curtains, or overhangs",null,null,"Note: per the TRM, claimed peak demand savings are the maximum value across the various orientations, rather than being additive."]
[null,"HVAC Variable Frequency Drives (VFD's)"]
["HIDE","Peak kW","NCP kW","kWh","Uncapped Incentive","Quantity","Application","Building Type",null,"Motor Size (HP)","Existing Control Type\n(AHU Supply Fans Only)",null,"kWh/HP","kW/HP Summer","kW/HP Winter","NCP kW/HP"]
["HIDE",{"$f":"ROUND(F26*J26*MAX(N26,O26),3)","v":0},{"$f":"ROUND(F26*J26*P26,3)","v":0},{"$f":"ROUND(F26*J26*M26,0)","v":0},{"$f":"ROUND(IFERROR(INDEX('Savings Summary'!$P$8:$P$50,MATCH($B$24,'Savings Summary'!$C$8:$C$50,0))*D26+\nINDEX('Savings Summary'!$N$8:$N$50,MATCH($B$24,'Savings Summary'!$C$8:$C$50,0))*B26+\nINDEX('Savings Summary'!$O$8:$O$50,MATCH($B$24,'Savings Summary'!$C$8:$C$50,0))*C26,0),2)","v":0},null,null,null,null,null,null,null,{"$f":"IFERROR(INDEX(VFDSavingsTable,MATCH(1,(State&SelectedZone='Lookup tables'!$D$300:$D$335)*('HVAC & Envelope'!G26='Lookup tables'!$E$300:$E$335)*('HVAC & Envelope'!K26='Lookup tables'!$F$300:$F$335),0),MATCH(1,('HVAC & Envelope'!H26='Lookup tables'!$G$298:$AP$298)*(\"kWh\"='Lookup tables'!$G$299:$AR$299),0)),0)","v":0},{"$f":"IF(G26=\"Hot Water Pump\",0,IFERROR(INDEX(VFDSavingsTable,MATCH(1,(State&SelectedZone='Lookup tables'!$D$300:$D$335)*('HVAC & Envelope'!G26='Lookup tables'!$E$300:$E$335)*('HVAC & Envelope'!K26='Lookup tables'!$F$300:$F$335),0),MATCH(1,('HVAC & Envelope'!H26='Lookup tables'!$G$298:$AP$298)*(\"kW\"='Lookup tables'!$G$299:$AR$299),0)),0))","v":0},{"$f":"IF(G26=\"Hot Water Pump\",IFERROR(INDEX(VFDSavingsTable,MATCH(1,(State&SelectedZone='Lookup tables'!$D$300:$D$335)*('HVAC & Envelope'!G26='Lookup tables'!$E$300:$E$335)*('HVAC & Envelope'!K26='Lookup tables'!$F$300:$F$335),0),MATCH(1,('HVAC & Envelope'!H26='Lookup tables'!$G$298:$AP$298)*(\"kW\"='Lookup tables'!$G$299:$AR$299),0)),0),0)","v":0},{"$f":"IFERROR(INDEX(VFDSavingsTable,MATCH(1,(State&SelectedZone='Lookup tables'!$D$300:$D$335)*('HVAC & Envelope'!G26='Lookup tables'!$E$300:$E$335)*('HVAC & Envelope'!K26='Lookup tables'!$F$300:$F$335),0),MATCH(1,('HVAC & Envelope'!H26='Lookup tables'!$G$298:$BI$298)*(\"NCP kW\"='Lookup tables'!$G$299:$BK$299),0)),0)","v":0}]
["HIDE",0,0,0,{"$f":"ROUND(IFERROR(INDEX('Savings Summary'!$P$8:$P$50,MATCH($B$24,'Savings Summary'!$C$8:$C$50,0))*D27+\nINDEX('Savings Summary'!$N$8:$N$50,MATCH($B$24,'Savings Summary'!$C$8:$C$50,0))*B27+\nINDEX('Savings Summary'!$O$8:$O$50,MATCH($B$24,'Savings Summary'!$C$8:$C$50,0))*C27,0),2)","v":0},null,null,null,null,null,null,null,{"$f":"IFERROR(INDEX(VFDSavingsTable,MATCH(1,(State&SelectedZone='Lookup tables'!$D$300:$D$335)*('HVAC & Envelope'!G27='Lookup tables'!$E$300:$E$335)*('HVAC & Envelope'!K27='Lookup tables'!$F$300:$F$335),0),MATCH(1,('HVAC & Envelope'!H27='Lookup tables'!$G$298:$AP$298)*(\"kWh\"='Lookup tables'!$G$299:$AR$299),0)),0)","v":0},{"$f":"IF(G27=\"Hot Water Pump\",0,IFERROR(INDEX(VFDSavingsTable,MATCH(1,(State&SelectedZone='Lookup tables'!$D$300:$D$335)*('HVAC & Envelope'!G27='Lookup tables'!$E$300:$E$335)*('HVAC & Envelope'!K27='Lookup tables'!$F$300:$F$335),0),MATCH(1,('HVAC & Envelope'!H27='Lookup tables'!$G$298:$AP$298)*(\"kW\"='Lookup tables'!$G$299:$AR$299),0)),0))","v":0},{"$f":"IF(G27=\"Hot Water Pump\",IFERROR(INDEX(VFDSavingsTable,MATCH(1,(State&SelectedZone='Lookup tables'!$D$300:$D$335)*('HVAC & Envelope'!G27='Lookup tables'!$E$300:$E$335)*('HVAC & Envelope'!K27='Lookup tables'!$F$300:$F$335),0),MATCH(1,('HVAC & Envelope'!H27='Lookup tables'!$G$298:$AP$298)*(\"kW\"='Lookup tables'!$G$299:$AR$299),0)),0),0)","v":0},{"$f":"IFERROR(INDEX(VFDSavingsTable,MATCH(1,(State&SelectedZone='Lookup tables'!$D$300:$D$335)*('HVAC & Envelope'!G27='Lookup tables'!$E$300:$E$335)*('HVAC & Envelope'!K27='Lookup tables'!$F$300:$F$335),0),MATCH(1,('HVAC & Envelope'!H27='Lookup tables'!$G$298:$BI$298)*(\"NCP kW\"='Lookup tables'!$G$299:$BK$299),0)),0)","v":0}]
["HIDE",0,0,0,{"$f":"ROUND(IFERROR(INDEX('Savings Summary'!$P$8:$P$50,MATCH($B$24,'Savings Summary'!$C$8:$C$50,0))*D28+\nINDEX('Savings Summary'!$N$8:$N$50,MATCH($B$24,'Savings Summary'!$C$8:$C$50,0))*B28+\nINDEX('Savings Summary'!$O$8:$O$50,MATCH($B$24,'Savings Summary'!$C$8:$C$50,0))*C28,0),2)","v":0},null,null,null,null,null,null,null,{"$f":"IFERROR(INDEX(VFDSavingsTable,MATCH(1,(State&SelectedZone='Lookup tables'!$D$300:$D$335)*('HVAC & Envelope'!G28='Lookup tables'!$E$300:$E$335)*('HVAC & Envelope'!K28='Lookup tables'!$F$300:$F$335),0),MATCH(1,('HVAC & Envelope'!H28='Lookup tables'!$G$298:$AP$298)*(\"kWh\"='Lookup tables'!$G$299:$AR$299),0)),0)","v":0},{"$f":"IF(G28=\"Hot Water Pump\",0,IFERROR(INDEX(VFDSavingsTable,MATCH(1,(State&SelectedZone='Lookup tables'!$D$300:$D$335)*('HVAC & Envelope'!G28='Lookup tables'!$E$300:$E$335)*('HVAC & Envelope'!K28='Lookup tables'!$F$300:$F$335),0),MATCH(1,('HVAC & Envelope'!H28='Lookup tables'!$G$298:$AP$298)*(\"kW\"='Lookup tables'!$G$299:$AR$299),0)),0))","v":0},{"$f":"IF(G28=\"Hot Water Pump\",IFERROR(INDEX(VFDSavingsTable,MATCH(1,(State&SelectedZone='Lookup tables'!$D$300:$D$335)*('HVAC & Envelope'!G28='Lookup tables'!$E$300:$E$335)*('HVAC & Envelope'!K28='Lookup tables'!$F$300:$F$335),0),MATCH(1,('HVAC & Envelope'!H28='Lookup tables'!$G$298:$AP$298)*(\"kW\"='Lookup tables'!$G$299:$AR$299),0)),0),0)","v":0},{"$f":"IFERROR(INDEX(VFDSavingsTable,MATCH(1,(State&SelectedZone='Lookup tables'!$D$300:$D$335)*('HVAC & Envelope'!G28='Lookup tables'!$E$300:$E$335)*('HVAC & Envelope'!K28='Lookup tables'!$F$300:$F$335),0),MATCH(1,('HVAC & Envelope'!H28='Lookup tables'!$G$298:$BI$298)*(\"NCP kW\"='Lookup tables'!$G$299:$BK$299),0)),0)","v":0}]
["HIDE",0,0,0,{"$f":"ROUND(IFERROR(INDEX('Savings Summary'!$P$8:$P$50,MATCH($B$24,'Savings Summary'!$C$8:$C$50,0))*D29+\nINDEX('Savings Summary'!$N$8:$N$50,MATCH($B$24,'Savings Summary'!$C$8:$C$50,0))*B29+\nINDEX('Savings Summary'!$O$8:$O$50,MATCH($B$24,'Savings Summary'!$C$8:$C$50,0))*C29,0),2)","v":0},null,null,null,null,null,null,null,{"$f":"IFERROR(INDEX(VFDSavingsTable,MATCH(1,(State&SelectedZone='Lookup tables'!$D$300:$D$335)*('HVAC & Envelope'!G29='Lookup tables'!$E$300:$E$335)*('HVAC & Envelope'!K29='Lookup tables'!$F$300:$F$335),0),MATCH(1,('HVAC & Envelope'!H29='Lookup tables'!$G$298:$AP$298)*(\"kWh\"='Lookup tables'!$G$299:$AR$299),0)),0)","v":0},{"$f":"IF(G29=\"Hot Water Pump\",0,IFERROR(INDEX(VFDSavingsTable,MATCH(1,(State&SelectedZone='Lookup tables'!$D$300:$D$335)*('HVAC & Envelope'!G29='Lookup tables'!$E$300:$E$335)*('HVAC & Envelope'!K29='Lookup tables'!$F$300:$F$335),0),MATCH(1,('HVAC & Envelope'!H29='Lookup tables'!$G$298:$AP$298)*(\"kW\"='Lookup tables'!$G$299:$AR$299),0)),0))","v":0},{"$f":"IF(G29=\"Hot Water Pump\",IFERROR(INDEX(VFDSavingsTable,MATCH(1,(State&SelectedZone='Lookup tables'!$D$300:$D$335)*('HVAC & Envelope'!G29='Lookup tables'!$E$300:$E$335)*('HVAC & Envelope'!K29='Lookup tables'!$F$300:$F$335),0),MATCH(1,('HVAC & Envelope'!H29='Lookup tables'!$G$298:$AP$298)*(\"kW\"='Lookup tables'!$G$299:$AR$299),0)),0),0)","v":0},{"$f":"IFERROR(INDEX(VFDSavingsTable,MATCH(1,(State&SelectedZone='Lookup tables'!$D$300:$D$335)*('HVAC & Envelope'!G29='Lookup tables'!$E$300:$E$335)*('HVAC & Envelope'!K29='Lookup tables'!$F$300:$F$335),0),MATCH(1,('HVAC & Envelope'!H29='Lookup tables'!$G$298:$BI$298)*(\"NCP kW\"='Lookup tables'!$G$299:$BK$299),0)),0)","v":0}]
["HIDE",0,0,0,{"$f":"ROUND(IFERROR(INDEX('Savings Summary'!$P$8:$P$50,MATCH($B$24,'Savings Summary'!$C$8:$C$50,0))*D30+\nINDEX('Savings Summary'!$N$8:$N$50,MATCH($B$24,'Savings Summary'!$C$8:$C$50,0))*B30+\nINDEX('Savings Summary'!$O$8:$O$50,MATCH($B$24,'Savings Summary'!$C$8:$C$50,0))*C30,0),2)","v":0},null,null,null,null,null,null,null,{"$f":"IFERROR(INDEX(VFDSavingsTable,MATCH(1,(State&SelectedZone='Lookup tables'!$D$300:$D$335)*('HVAC & Envelope'!G30='Lookup tables'!$E$300:$E$335)*('HVAC & Envelope'!K30='Lookup tables'!$F$300:$F$335),0),MATCH(1,('HVAC & Envelope'!H30='Lookup tables'!$G$298:$AP$298)*(\"kWh\"='Lookup tables'!$G$299:$AR$299),0)),0)","v":0},{"$f":"IF(G30=\"Hot Water Pump\",0,IFERROR(INDEX(VFDSavingsTable,MATCH(1,(State&SelectedZone='Lookup tables'!$D$300:$D$335)*('HVAC & Envelope'!G30='Lookup tables'!$E$300:$E$335)*('HVAC & Envelope'!K30='Lookup tables'!$F$300:$F$335),0),MATCH(1,('HVAC & Envelope'!H30='Lookup tables'!$G$298:$AP$298)*(\"kW\"='Lookup tables'!$G$299:$AR$299),0)),0))","v":0},{"$f":"IF(G30=\"Hot Water Pump\",IFERROR(INDEX(VFDSavingsTable,MATCH(1,(State&SelectedZone='Lookup tables'!$D$300:$D$335)*('HVAC & Envelope'!G30='Lookup tables'!$E$300:$E$335)*('HVAC & Envelope'!K30='Lookup tables'!$F$300:$F$335),0),MATCH(1,('HVAC & Envelope'!H30='Lookup tables'!$G$298:$AP$298)*(\"kW\"='Lookup tables'!$G$299:$AR$299),0)),0),0)","v":0},{"$f":"IFERROR(INDEX(VFDSavingsTable,MATCH(1,(State&SelectedZone='Lookup tables'!$D$300:$D$335)*('HVAC & Envelope'!G30='Lookup tables'!$E$300:$E$335)*('HVAC & Envelope'!K30='Lookup tables'!$F$300:$F$335),0),MATCH(1,('HVAC & Envelope'!H30='Lookup tables'!$G$298:$BI$298)*(\"NCP kW\"='Lookup tables'!$G$299:$BK$299),0)),0)","v":0}]
["HIDE",0,0,0,{"$f":"ROUND(IFERROR(INDEX('Savings Summary'!$P$8:$P$50,MATCH($B$24,'Savings Summary'!$C$8:$C$50,0))*D31+\nINDEX('Savings Summary'!$N$8:$N$50,MATCH($B$24,'Savings Summary'!$C$8:$C$50,0))*B31+\nINDEX('Savings Summary'!$O$8:$O$50,MATCH($B$24,'Savings Summary'!$C$8:$C$50,0))*C31,0),2)","v":0},null,null,null,null,null,null,null,{"$f":"IFERROR(INDEX(VFDSavingsTable,MATCH(1,(State&SelectedZone='Lookup tables'!$D$300:$D$335)*('HVAC & Envelope'!G31='Lookup tables'!$E$300:$E$335)*('HVAC & Envelope'!K31='Lookup tables'!$F$300:$F$335),0),MATCH(1,('HVAC & Envelope'!H31='Lookup tables'!$G$298:$AP$298)*(\"kWh\"='Lookup tables'!$G$299:$AR$299),0)),0)","v":0},{"$f":"IF(G31=\"Hot Water Pump\",0,IFERROR(INDEX(VFDSavingsTable,MATCH(1,(State&SelectedZone='Lookup tables'!$D$300:$D$335)*('HVAC & Envelope'!G31='Lookup tables'!$E$300:$E$335)*('HVAC & Envelope'!K31='Lookup tables'!$F$300:$F$335),0),MATCH(1,('HVAC & Envelope'!H31='Lookup tables'!$G$298:$AP$298)*(\"kW\"='Lookup tables'!$G$299:$AR$299),0)),0))","v":0},{"$f":"IF(G31=\"Hot Water Pump\",IFERROR(INDEX(VFDSavingsTable,MATCH(1,(State&SelectedZone='Lookup tables'!$D$300:$D$335)*('HVAC & Envelope'!G31='Lookup tables'!$E$300:$E$335)*('HVAC & Envelope'!K31='Lookup tables'!$F$300:$F$335),0),MATCH(1,('HVAC & Envelope'!H31='Lookup tables'!$G$298:$AP$298)*(\"kW\"='Lookup tables'!$G$299:$AR$299),0)),0),0)","v":0},{"$f":"IFERROR(INDEX(VFDSavingsTable,MATCH(1,(State&SelectedZone='Lookup tables'!$D$300:$D$335)*('HVAC & Envelope'!G31='Lookup tables'!$E$300:$E$335)*('HVAC & Envelope'!K31='Lookup tables'!$F$300:$F$335),0),MATCH(1,('HVAC & Envelope'!H31='Lookup tables'!$G$298:$BI$298)*(\"NCP kW\"='Lookup tables'!$G$299:$BK$299),0)),0)","v":0}]
["HIDE",0,0,0,{"$f":"ROUND(IFERROR(INDEX('Savings Summary'!$P$8:$P$50,MATCH($B$24,'Savings Summary'!$C$8:$C$50,0))*D32+\nINDEX('Savings Summary'!$N$8:$N$50,MATCH($B$24,'Savings Summary'!$C$8:$C$50,0))*B32+\nINDEX('Savings Summary'!$O$8:$O$50,MATCH($B$24,'Savings Summary'!$C$8:$C$50,0))*C32,0),2)","v":0},null,null,null,null,null,null,null,{"$f":"IFERROR(INDEX(VFDSavingsTable,MATCH(1,(State&SelectedZone='Lookup tables'!$D$300:$D$335)*('HVAC & Envelope'!G32='Lookup tables'!$E$300:$E$335)*('HVAC & Envelope'!K32='Lookup tables'!$F$300:$F$335),0),MATCH(1,('HVAC & Envelope'!H32='Lookup tables'!$G$298:$AP$298)*(\"kWh\"='Lookup tables'!$G$299:$AR$299),0)),0)","v":0},{"$f":"IF(G32=\"Hot Water Pump\",0,IFERROR(INDEX(VFDSavingsTable,MATCH(1,(State&SelectedZone='Lookup tables'!$D$300:$D$335)*('HVAC & Envelope'!G32='Lookup tables'!$E$300:$E$335)*('HVAC & Envelope'!K32='Lookup tables'!$F$300:$F$335),0),MATCH(1,('HVAC & Envelope'!H32='Lookup tables'!$G$298:$AP$298)*(\"kW\"='Lookup tables'!$G$299:$AR$299),0)),0))","v":0},{"$f":"IF(G32=\"Hot Water Pump\",IFERROR(INDEX(VFDSavingsTable,MATCH(1,(State&SelectedZone='Lookup tables'!$D$300:$D$335)*('HVAC & Envelope'!G32='Lookup tables'!$E$300:$E$335)*('HVAC & Envelope'!K32='Lookup tables'!$F$300:$F$335),0),MATCH(1,('HVAC & Envelope'!H32='Lookup tables'!$G$298:$AP$298)*(\"kW\"='Lookup tables'!$G$299:$AR$299),0)),0),0)","v":0},{"$f":"IFERROR(INDEX(VFDSavingsTable,MATCH(1,(State&SelectedZone='Lookup tables'!$D$300:$D$335)*('HVAC & Envelope'!G32='Lookup tables'!$E$300:$E$335)*('HVAC & Envelope'!K32='Lookup tables'!$F$300:$F$335),0),MATCH(1,('HVAC & Envelope'!H32='Lookup tables'!$G$298:$BI$298)*(\"NCP kW\"='Lookup tables'!$G$299:$BK$299),0)),0)","v":0}]
["HIDE",0,0,0,{"$f":"ROUND(IFERROR(INDEX('Savings Summary'!$P$8:$P$50,MATCH($B$24,'Savings Summary'!$C$8:$C$50,0))*D33+\nINDEX('Savings Summary'!$N$8:$N$50,MATCH($B$24,'Savings Summary'!$C$8:$C$50,0))*B33+\nINDEX('Savings Summary'!$O$8:$O$50,MATCH($B$24,'Savings Summary'!$C$8:$C$50,0))*C33,0),2)","v":0},null,null,null,null,null,null,null,{"$f":"IFERROR(INDEX(VFDSavingsTable,MATCH(1,(State&SelectedZone='Lookup tables'!$D$300:$D$335)*('HVAC & Envelope'!G33='Lookup tables'!$E$300:$E$335)*('HVAC & Envelope'!K33='Lookup tables'!$F$300:$F$335),0),MATCH(1,('HVAC & Envelope'!H33='Lookup tables'!$G$298:$AP$298)*(\"kWh\"='Lookup tables'!$G$299:$AR$299),0)),0)","v":0},{"$f":"IF(G33=\"Hot Water Pump\",0,IFERROR(INDEX(VFDSavingsTable,MATCH(1,(State&SelectedZone='Lookup tables'!$D$300:$D$335)*('HVAC & Envelope'!G33='Lookup tables'!$E$300:$E$335)*('HVAC & Envelope'!K33='Lookup tables'!$F$300:$F$335),0),MATCH(1,('HVAC & Envelope'!H33='Lookup tables'!$G$298:$AP$298)*(\"kW\"='Lookup tables'!$G$299:$AR$299),0)),0))","v":0},{"$f":"IF(G33=\"Hot Water Pump\",IFERROR(INDEX(VFDSavingsTable,MATCH(1,(State&SelectedZone='Lookup tables'!$D$300:$D$335)*('HVAC & Envelope'!G33='Lookup tables'!$E$300:$E$335)*('HVAC & Envelope'!K33='Lookup tables'!$F$300:$F$335),0),MATCH(1,('HVAC & Envelope'!H33='Lookup tables'!$G$298:$AP$298)*(\"kW\"='Lookup tables'!$G$299:$AR$299),0)),0),0)","v":0},{"$f":"IFERROR(INDEX(VFDSavingsTable,MATCH(1,(State&SelectedZone='Lookup tables'!$D$300:$D$335)*('HVAC & Envelope'!G33='Lookup tables'!$E$300:$E$335)*('HVAC & Envelope'!K33='Lookup tables'!$F$300:$F$335),0),MATCH(1,('HVAC & Envelope'!H33='Lookup tables'!$G$298:$BI$298)*(\"NCP kW\"='Lookup tables'!$G$299:$BK$299),0)),0)","v":0}]
["HIDE",0,0,0,{"$f":"ROUND(IFERROR(INDEX('Savings Summary'!$P$8:$P$50,MATCH($B$24,'Savings Summary'!$C$8:$C$50,0))*D34+\nINDEX('Savings Summary'!$N$8:$N$50,MATCH($B$24,'Savings Summary'!$C$8:$C$50,0))*B34+\nINDEX('Savings Summary'!$O$8:$O$50,MATCH($B$24,'Savings Summary'!$C$8:$C$50,0))*C34,0),2)","v":0},null,null,null,null,null,null,null,{"$f":"IFERROR(INDEX(VFDSavingsTable,MATCH(1,(State&SelectedZone='Lookup tables'!$D$300:$D$335)*('HVAC & Envelope'!G34='Lookup tables'!$E$300:$E$335)*('HVAC & Envelope'!K34='Lookup tables'!$F$300:$F$335),0),MATCH(1,('HVAC & Envelope'!H34='Lookup tables'!$G$298:$AP$298)*(\"kWh\"='Lookup tables'!$G$299:$AR$299),0)),0)","v":0},{"$f":"IF(G34=\"Hot Water Pump\",0,IFERROR(INDEX(VFDSavingsTable,MATCH(1,(State&SelectedZone='Lookup tables'!$D$300:$D$335)*('HVAC & Envelope'!G34='Lookup tables'!$E$300:$E$335)*('HVAC & Envelope'!K34='Lookup tables'!$F$300:$F$335),0),MATCH(1,('HVAC & Envelope'!H34='Lookup tables'!$G$298:$AP$298)*(\"kW\"='Lookup tables'!$G$299:$AR$299),0)),0))","v":0},{"$f":"IF(G34=\"Hot Water Pump\",IFERROR(INDEX(VFDSavingsTable,MATCH(1,(State&SelectedZone='Lookup tables'!$D$300:$D$335)*('HVAC & Envelope'!G34='Lookup tables'!$E$300:$E$335)*('HVAC & Envelope'!K34='Lookup tables'!$F$300:$F$335),0),MATCH(1,('HVAC & Envelope'!H34='Lookup tables'!$G$298:$AP$298)*(\"kW\"='Lookup tables'!$G$299:$AR$299),0)),0),0)","v":0},{"$f":"IFERROR(INDEX(VFDSavingsTable,MATCH(1,(State&SelectedZone='Lookup tables'!$D$300:$D$335)*('HVAC & Envelope'!G34='Lookup tables'!$E$300:$E$335)*('HVAC & Envelope'!K34='Lookup tables'!$F$300:$F$335),0),MATCH(1,('HVAC & Envelope'!H34='Lookup tables'!$G$298:$BI$298)*(\"NCP kW\"='Lookup tables'!$G$299:$BK$299),0)),0)","v":0}]
["HIDE",0,0,0,{"$f":"ROUND(IFERROR(INDEX('Savings Summary'!$P$8:$P$50,MATCH($B$24,'Savings Summary'!$C$8:$C$50,0))*D35+\nINDEX('Savings Summary'!$N$8:$N$50,MATCH($B$24,'Savings Summary'!$C$8:$C$50,0))*B35+\nINDEX('Savings Summary'!$O$8:$O$50,MATCH($B$24,'Savings Summary'!$C$8:$C$50,0))*C35,0),2)","v":0},null,null,null,null,null,null,null,{"$f":"IFERROR(INDEX(VFDSavingsTable,MATCH(1,(State&SelectedZone='Lookup tables'!$D$300:$D$335)*('HVAC & Envelope'!G35='Lookup tables'!$E$300:$E$335)*('HVAC & Envelope'!K35='Lookup tables'!$F$300:$F$335),0),MATCH(1,('HVAC & Envelope'!H35='Lookup tables'!$G$298:$AP$298)*(\"kWh\"='Lookup tables'!$G$299:$AR$299),0)),0)","v":0},{"$f":"IF(G35=\"Hot Water Pump\",0,IFERROR(INDEX(VFDSavingsTable,MATCH(1,(State&SelectedZone='Lookup tables'!$D$300:$D$335)*('HVAC & Envelope'!G35='Lookup tables'!$E$300:$E$335)*('HVAC & Envelope'!K35='Lookup tables'!$F$300:$F$335),0),MATCH(1,('HVAC & Envelope'!H35='Lookup tables'!$G$298:$AP$298)*(\"kW\"='Lookup tables'!$G$299:$AR$299),0)),0))","v":0},{"$f":"IF(G35=\"Hot Water Pump\",IFERROR(INDEX(VFDSavingsTable,MATCH(1,(State&SelectedZone='Lookup tables'!$D$300:$D$335)*('HVAC & Envelope'!G35='Lookup tables'!$E$300:$E$335)*('HVAC & Envelope'!K35='Lookup tables'!$F$300:$F$335),0),MATCH(1,('HVAC & Envelope'!H35='Lookup tables'!$G$298:$AP$298)*(\"kW\"='Lookup tables'!$G$299:$AR$299),0)),0),0)","v":0},{"$f":"IFERROR(INDEX(VFDSavingsTable,MATCH(1,(State&SelectedZone='Lookup tables'!$D$300:$D$335)*('HVAC & Envelope'!G35='Lookup tables'!$E$300:$E$335)*('HVAC & Envelope'!K35='Lookup tables'!$F$300:$F$335),0),MATCH(1,('HVAC & Envelope'!H35='Lookup tables'!$G$298:$BI$298)*(\"NCP kW\"='Lookup tables'!$G$299:$BK$299),0)),0)","v":0}]
["HIDE",{"$f":"SUM(B26:B35)","v":0},{"$f":"SUM(C26:C35)","v":0},{"$f":"SUM(D26:D35)","v":0},{"$f":"SUM(E26:E35)","v":0},"Eligibility Criteria:","·Retrofit Only\n·AHU Supply Fans cannnot have Variable Pitch Blades",null,null,null,null,null,null,{"$f":"SUMPRODUCT(N26:N35,F26:F35,J26:J35)","v":0},{"$f":"SUMPRODUCT(O26:O35,F26:F35,J26:J35)","v":0}]
[null,"Condenser Air Evaporative Pre-Cooling"]
["HIDE","Peak kW","NCP kW","kWh","Uncapped Incentive","Unit Quantity","Building Type","HVAC Equipment Type","HVAC AHRI Capacity \n(Tons or Btu/h)","HVAC AHRI Full-Load Efficiency* \n(EER or kW/ton)","HVAC AHRI Part-Load Efficiency* (SEER, IEER, or kW/ton)",null,"DRF","EFLH red","Tons to use","FL to use (kW/ton)","PL to use (kW/ton)","kWh savings","kW savings"]
["HIDE",{"$f":"ROUND(IFERROR(S39,0),3)","v":0},{"$f":"ROUND(IFERROR(S39,0),3)","v":0},{"$f":"ROUND(IFERROR(R39,0),0)","v":0},{"$f":"ROUND(IFERROR(INDEX('Savings Summary'!$P$8:$P$50,MATCH($B$37,'Savings Summary'!$C$8:$C$50,0))*D39+\nINDEX('Savings Summary'!$N$8:$N$50,MATCH($B$37,'Savings Summary'!$C$8:$C$50,0))*B39+\nINDEX('Savings Summary'!$O$8:$O$50,MATCH($B$37,'Savings Summary'!$C$8:$C$50,0))*C39,0),2)","v":0},null,null,null,null,null,null,null,{"$f":"INDEX('Lookup tables'!$E$341:$P$363,MATCH(G39,'Lookup tables'!$D$341:$D$363,0),MATCH(State&SelectedZone&IF(H39=\"Direct Expansion\",\"DX\",IF(H39=\"Air Cooled Chiller\",\"ACC\")),'Lookup tables'!$E$340:$P$340,0))","v":{"$error":"#N/A"}},{"$f":"INDEX('Lookup tables'!$Q$341:$AB$363,MATCH(G39,'Lookup tables'!$D$341:$D$363,0),MATCH(State&SelectedZone&IF(H39=\"Direct Expansion\",\"DX\",IF(H39=\"Air Cooled Chiller\",\"ACC\")),'Lookup tables'!$E$340:$P$340,0))","v":{"$error":"#N/A"}},{"$f":"IF(I39>1000,I39/12000,I39)","v":0},{"$f":"IF(J39>4,12/J39,J39)","v":0},0,{"$f":"O39*Q39*N39*F39","v":{"$error":"#N/A"}},{"$f":"O39*P39*M39*F39","v":{"$error":"#N/A"}}]
["HIDE",{"$f":"ROUND(IFERROR(S40,0),3)","v":0},{"$f":"ROUND(IFERROR(S40,0),3)","v":0},{"$f":"ROUND(IFERROR(R40,0),0)","v":0},{"$f":"ROUND(IFERROR(INDEX('Savings Summary'!$P$8:$P$50,MATCH($B$37,'Savings Summary'!$C$8:$C$50,0))*D40+\nINDEX('Savings Summary'!$N$8:$N$50,MATCH($B$37,'Savings Summary'!$C$8:$C$50,0))*B40+\nINDEX('Savings Summary'!$O$8:$O$50,MATCH($B$37,'Savings Summary'!$C$8:$C$50,0))*C40,0),2)","v":0},null,null,null,null,null,null,null,{"$f":"INDEX('Lookup tables'!$E$341:$P$363,MATCH(G40,'Lookup tables'!$D$341:$D$363,0),MATCH(State&SelectedZone&IF(H40=\"Direct Expansion\",\"DX\",IF(H40=\"Air Cooled Chiller\",\"ACC\")),'Lookup tables'!$E$340:$P$340,0))","v":{"$error":"#N/A"}},{"$f":"INDEX('Lookup tables'!$Q$341:$AB$363,MATCH(G40,'Lookup tables'!$D$341:$D$363,0),MATCH(State&SelectedZone&IF(H40=\"Direct Expansion\",\"DX\",IF(H40=\"Air Cooled Chiller\",\"ACC\")),'Lookup tables'!$E$340:$P$340,0))","v":{"$error":"#N/A"}},{"$f":"IF(I40>1000,I40/12000,I40)","v":0},0,0,{"$f":"O40*Q40*N40*F40","v":{"$error":"#N/A"}},{"$f":"O40*P40*M40*F40","v":{"$error":"#N/A"}}]
["HIDE",0,0,0,{"$f":"ROUND(IFERROR(INDEX('Savings Summary'!$P$8:$P$50,MATCH($B$37,'Savings Summary'!$C$8:$C$50,0))*D41+\nINDEX('Savings Summary'!$N$8:$N$50,MATCH($B$37,'Savings Summary'!$C$8:$C$50,0))*B41+\nINDEX('Savings Summary'!$O$8:$O$50,MATCH($B$37,'Savings Summary'!$C$8:$C$50,0))*C41,0),2)","v":0},null,null,null,null,null,null,null,{"$f":"INDEX('Lookup tables'!$E$341:$P$363,MATCH(G41,'Lookup tables'!$D$341:$D$363,0),MATCH(State&SelectedZone&IF(H41=\"Direct Expansion\",\"DX\",IF(H41=\"Air Cooled Chiller\",\"ACC\")),'Lookup tables'!$E$340:$P$340,0))","v":{"$error":"#N/A"}},{"$f":"INDEX('Lookup tables'!$Q$341:$AB$363,MATCH(G41,'Lookup tables'!$D$341:$D$363,0),MATCH(State&SelectedZone&IF(H41=\"Direct Expansion\",\"DX\",IF(H41=\"Air Cooled Chiller\",\"ACC\")),'Lookup tables'!$E$340:$P$340,0))","v":{"$error":"#N/A"}},{"$f":"IF(I41>1000,I41/12000,I41)","v":0},0,0,{"$f":"O41*Q41*N41*F41","v":{"$error":"#N/A"}},{"$f":"O41*P41*M41*F41","v":{"$error":"#N/A"}}]
["HIDE",0,0,0,{"$f":"ROUND(IFERROR(INDEX('Savings Summary'!$P$8:$P$50,MATCH($B$37,'Savings Summary'!$C$8:$C$50,0))*D42+\nINDEX('Savings Summary'!$N$8:$N$50,MATCH($B$37,'Savings Summary'!$C$8:$C$50,0))*B42+\nINDEX('Savings Summary'!$O$8:$O$50,MATCH($B$37,'Savings Summary'!$C$8:$C$50,0))*C42,0),2)","v":0},null,null,null,null,null,null,null,{"$f":"INDEX('Lookup tables'!$E$341:$P$363,MATCH(G42,'Lookup tables'!$D$341:$D$363,0),MATCH(State&SelectedZone&IF(H42=\"Direct Expansion\",\"DX\",IF(H42=\"Air Cooled Chiller\",\"ACC\")),'Lookup tables'!$E$340:$P$340,0))","v":{"$error":"#N/A"}},{"$f":"INDEX('Lookup tables'!$Q$341:$AB$363,MATCH(G42,'Lookup tables'!$D$341:$D$363,0),MATCH(State&SelectedZone&IF(H42=\"Direct Expansion\",\"DX\",IF(H42=\"Air Cooled Chiller\",\"ACC\")),'Lookup tables'!$E$340:$P$340,0))","v":{"$error":"#N/A"}},{"$f":"IF(I42>1000,I42/12000,I42)","v":0},0,0,{"$f":"O42*Q42*N42*F42","v":{"$error":"#N/A"}},{"$f":"O42*P42*M42*F42","v":{"$error":"#N/A"}}]
["HIDE",0,0,0,{"$f":"ROUND(IFERROR(INDEX('Savings Summary'!$P$8:$P$50,MATCH($B$37,'Savings Summary'!$C$8:$C$50,0))*D43+\nINDEX('Savings Summary'!$N$8:$N$50,MATCH($B$37,'Savings Summary'!$C$8:$C$50,0))*B43+\nINDEX('Savings Summary'!$O$8:$O$50,MATCH($B$37,'Savings Summary'!$C$8:$C$50,0))*C43,0),2)","v":0},null,null,null,null,null,null,null,{"$f":"INDEX('Lookup tables'!$E$341:$P$363,MATCH(G43,'Lookup tables'!$D$341:$D$363,0),MATCH(State&SelectedZone&IF(H43=\"Direct Expansion\",\"DX\",IF(H43=\"Air Cooled Chiller\",\"ACC\")),'Lookup tables'!$E$340:$P$340,0))","v":{"$error":"#N/A"}},{"$f":"INDEX('Lookup tables'!$Q$341:$AB$363,MATCH(G43,'Lookup tables'!$D$341:$D$363,0),MATCH(State&SelectedZone&IF(H43=\"Direct Expansion\",\"DX\",IF(H43=\"Air Cooled Chiller\",\"ACC\")),'Lookup tables'!$E$340:$P$340,0))","v":{"$error":"#N/A"}},{"$f":"IF(I43>1000,I43/12000,I43)","v":0},0,0,{"$f":"O43*Q43*N43*F43","v":{"$error":"#N/A"}},{"$f":"O43*P43*M43*F43","v":{"$error":"#N/A"}}]
["HIDE",{"$f":"SUM(B39:B43)","v":0},{"$f":"SUM(C39:C43)","v":0},{"$f":"SUM(D39:D43)","v":0},{"$f":"SUM(E39:E43)","v":0},"Eligibility Criteria:","·Must exceed evaporative effectiveness performance of 75% during peak weather conditions.",null,"*If unknown, reference the TX TRM 7.0 Vol 3: tables 2-25 through 2.29 for Air Conditioners & Heat Pumps, or tables 2-40 through 2-51 for Chillers."]
[null,"Lodging Occupancy Controls"]
["HIDE","Peak kW","NCP kW","kWh","Uncapped Incentive","Number of Rooms","Building Type","Proposed Control Type","Heating Type","Temperature Offset Range"]
["HIDE",{"$f":"ROUND(IFERROR($F47*INDEX('Lookup tables'!$H$371:$AE$388,MATCH(State&SelectedZone&$G47,'Lookup tables'!$G$371:$G$388,0),MATCH($J47&$I47&$H47&B$25,'Lookup tables'!$H$370:$AE$370,0)),0),3)","v":0},{"$f":"ROUND(IFERROR($F47*INDEX('Lookup tables'!$H$371:$AE$388,MATCH(State&SelectedZone&$G47,'Lookup tables'!$G$371:$G$388,0),MATCH($J47&$I47&$H47&C$25,'Lookup tables'!$H$370:$AE$370,0)),0),3)","v":0},{"$f":"ROUND(IFERROR($F47*INDEX('Lookup tables'!$H$371:$AE$388,MATCH(State&SelectedZone&$G47,'Lookup tables'!$G$371:$G$388,0),MATCH($J47&$I47&$H47&D$25,'Lookup tables'!$H$370:$AE$370,0)),0),0)","v":0},{"$f":"ROUND(IFERROR(INDEX('Savings Summary'!$P$8:$P$50,MATCH($B$45,'Savings Summary'!$C$8:$C$50,0))*D47+\nINDEX('Savings Summary'!$N$8:$N$50,MATCH($B$45,'Savings Summary'!$C$8:$C$50,0))*B47+\nINDEX('Savings Summary'!$O$8:$O$50,MATCH($B$45,'Savings Summary'!$C$8:$C$50,0))*C47,0),2)","v":0}]
["HIDE",{"$f":"ROUND(IFERROR($F48*INDEX('Lookup tables'!$H$371:$AE$388,MATCH(State&SelectedZone&$G48,'Lookup tables'!$G$371:$G$388,0),MATCH($J48&$I48&$H48&B$25,'Lookup tables'!$H$370:$AE$370,0)),0),3)","v":0},{"$f":"ROUND(IFERROR($F48*INDEX('Lookup tables'!$H$371:$AE$388,MATCH(State&SelectedZone&$G48,'Lookup tables'!$G$371:$G$388,0),MATCH($J48&$I48&$H48&C$25,'Lookup tables'!$H$370:$AE$370,0)),0),3)","v":0},{"$f":"ROUND(IFERROR($F48*INDEX('Lookup tables'!$H$371:$AE$388,MATCH(State&SelectedZone&$G48,'Lookup tables'!$G$371:$G$388,0),MATCH($J48&$I48&$H48&D$25,'Lookup tables'!$H$370:$AE$370,0)),0),0)","v":0},{"$f":"ROUND(IFERROR(INDEX('Savings Summary'!$P$8:$P$50,MATCH($B$45,'Savings Summary'!$C$8:$C$50,0))*D48+\nINDEX('Savings Summary'!$N$8:$N$50,MATCH($B$45,'Savings Summary'!$C$8:$C$50,0))*B48+\nINDEX('Savings Summary'!$O$8:$O$50,MATCH($B$45,'Savings Summary'!$C$8:$C$50,0))*C48,0),2)","v":0}]
["HIDE",{"$f":"ROUND(IFERROR($F49*INDEX('Lookup tables'!$H$371:$AE$388,MATCH(State&SelectedZone&$G49,'Lookup tables'!$G$371:$G$388,0),MATCH($J49&$I49&$H49&B$25,'Lookup tables'!$H$370:$AE$370,0)),0),3)","v":0},{"$f":"ROUND(IFERROR($F49*INDEX('Lookup tables'!$H$371:$AE$388,MATCH(State&SelectedZone&$G49,'Lookup tables'!$G$371:$G$388,0),MATCH($J49&$I49&$H49&C$25,'Lookup tables'!$H$370:$AE$370,0)),0),3)","v":0},{"$f":"ROUND(IFERROR($F49*INDEX('Lookup tables'!$H$371:$AE$388,MATCH(State&SelectedZone&$G49,'Lookup tables'!$G$371:$G$388,0),MATCH($J49&$I49&$H49&D$25,'Lookup tables'!$H$370:$AE$370,0)),0),0)","v":0},{"$f":"ROUND(IFERROR(INDEX('Savings Summary'!$P$8:$P$50,MATCH($B$45,'Savings Summary'!$C$8:$C$50,0))*D49+\nINDEX('Savings Summary'!$N$8:$N$50,MATCH($B$45,'Savings Summary'!$C$8:$C$50,0))*B49+\nINDEX('Savings Summary'!$O$8:$O$50,MATCH($B$45,'Savings Summary'!$C$8:$C$50,0))*C49,0),2)","v":0}]
["HIDE",{"$f":"SUM(B47:B49)","v":0},{"$f":"SUM(C47:C49)","v":0},{"$f":"SUM(D47:D49)","v":0},{"$f":"SUM(E47:E49)","v":0}]
[null,"Small Commercial Smart Thermostats",null,null,null,null,null,null,null,null,null,null,null,"Cooling Efficiency (kW/ton)","Heating Efficiency (COP)"]
["HIDE","Peak kW","NCP kW","kWh","Uncapped Incentive","Thermostat Quantity","Building Type","Baseline Control Strategy","Controlled HVAC Capacity per \nt-stat (Tons or Btu/h)","HVAC Part-Load Cooling Efficiency* \n(SEER, IEER, or kW/ton)","HVAC Heating Efficiency*\n(HSPF or COP)",null,"Capacity (tons)",null,null,"BAF","CRF","EFLH_c","kWh_c","HRF","EFLH_h","kWh_h","DF_s","kW_s"]
["HIDE",{"$f":"X53","v":0},{"$f":"B53","v":0},{"$f":"ROUND(S53+V53,0)","v":0},{"$f":"ROUND(IFERROR(INDEX('Savings Summary'!$P$8:$P$50,MATCH($B$51,'Savings Summary'!$C$8:$C$50,0))*D53+\nINDEX('Savings Summary'!$N$8:$N$50,MATCH($B$51,'Savings Summary'!$C$8:$C$50,0))*B53+\nINDEX('Savings Summary'!$O$8:$O$50,MATCH($B$51,'Savings Summary'!$C$8:$C$50,0))*C53,0),2)","v":0},null,null,null,null,null,null,null,{"$f":"I53/IF(I53>1000,12000,1)","v":0},{"$f":"IF(J53>3,12/J53,J53)","v":0},{"$f":"IF(K53>6,K53/3.412,K53)","v":0},{"$f":"IFERROR(INDEX(BAF,MATCH(H53,tstatbaseline,0)),0)","v":0},0.1,{"$f":"INDEX('Lookup tables'!E$397:X$422,MATCH(G53,'Lookup tables'!D$397:D$422,0),MATCH(State&SelectedZone&\"EFLHc\",'Lookup tables'!E$396:X$396,0))","v":{"$error":"#N/A"}},{"$f":"IFERROR(F53*Q53*P53*M53*N53*R53,0)","v":0},0.08,{"$f":"INDEX('Lookup tables'!E$397:X$422,MATCH(G53,'Lookup tables'!D$397:D$422,0),MATCH(State&SelectedZone&\"EFLHh\",'Lookup tables'!E$396:X$396,0))","v":{"$error":"#N/A"}},{"$f":"IFERROR(F53*T53*P53*M53/O53*U53*12/3.412,0)","v":0},{"$f":"INDEX('Lookup tables'!E$397:X$422,MATCH(G53,'Lookup tables'!D$397:D$422,0),MATCH(State&SelectedZone&\"DFs\",'Lookup tables'!E$396:X$396,0))","v":{"$error":"#N/A"}},{"$f":"IFERROR(F53*Q53*P53*M53*N53*W53,0)","v":0}]
["HIDE",{"$f":"X54","v":0},{"$f":"B54","v":0},{"$f":"ROUND(S54+V54,0)","v":0},{"$f":"ROUND(IFERROR(INDEX('Savings Summary'!$P$8:$P$50,MATCH($B$51,'Savings Summary'!$C$8:$C$50,0))*D54+\nINDEX('Savings Summary'!$N$8:$N$50,MATCH($B$51,'Savings Summary'!$C$8:$C$50,0))*B54+\nINDEX('Savings Summary'!$O$8:$O$50,MATCH($B$51,'Savings Summary'!$C$8:$C$50,0))*C54,0),2)","v":0},null,null,null,null,null,null,null,{"$f":"I54/IF(I54>1000,12000,1)","v":0},{"$f":"IF(J54>3,12/J54,J54)","v":0},{"$f":"IF(K54>6,K54/3.412,K54)","v":0},{"$f":"IFERROR(INDEX(BAF,MATCH(H54,tstatbaseline,0)),0)","v":0},0.1,{"$f":"INDEX('Lookup tables'!E$397:X$422,MATCH(G54,'Lookup tables'!D$397:D$422,0),MATCH(State&SelectedZone&\"EFLHc\",'Lookup tables'!E$396:X$396,0))","v":{"$error":"#N/A"}},{"$f":"IFERROR(F54*Q54*P54*M54*N54*R54,0)","v":0},0.08,{"$f":"INDEX('Lookup tables'!E$397:X$422,MATCH(G54,'Lookup tables'!D$397:D$422,0),MATCH(State&SelectedZone&\"EFLHh\",'Lookup tables'!E$396:X$396,0))","v":{"$error":"#N/A"}},{"$f":"IFERROR(F54*T54*P54*M54/O54*U54*12/3.412,0)","v":0},{"$f":"INDEX('Lookup tables'!E$397:X$422,MATCH(G54,'Lookup tables'!D$397:D$422,0),MATCH(State&SelectedZone&\"DFs\",'Lookup tables'!E$396:X$396,0))","v":{"$error":"#N/A"}},{"$f":"IFERROR(F54*Q54*P54*M54*N54*W54,0)","v":0}]
["HIDE",0,0,{"$f":"ROUND(S55+V55,0)","v":0},{"$f":"ROUND(IFERROR(INDEX('Savings Summary'!$P$8:$P$50,MATCH($B$51,'Savings Summary'!$C$8:$C$50,0))*D55+\nINDEX('Savings Summary'!$N$8:$N$50,MATCH($B$51,'Savings Summary'!$C$8:$C$50,0))*B55+\nINDEX('Savings Summary'!$O$8:$O$50,MATCH($B$51,'Savings Summary'!$C$8:$C$50,0))*C55,0),2)","v":0},null,null,null,null,null,null,null,{"$f":"I55/IF(I55>1000,12000,1)","v":0},{"$f":"IF(J55>3,12/J55,J55)","v":0},{"$f":"IF(K55>6,K55/3.412,K55)","v":0},{"$f":"IFERROR(INDEX(BAF,MATCH(H55,tstatbaseline,0)),0)","v":0},0.1,{"$f":"INDEX('Lookup tables'!E$397:X$422,MATCH(G55,'Lookup tables'!D$397:D$422,0),MATCH(State&SelectedZone&\"EFLHc\",'Lookup tables'!E$396:X$396,0))","v":{"$error":"#N/A"}},{"$f":"IFERROR(F55*Q55*P55*M55*N55*R55,0)","v":0},0.08,{"$f":"INDEX('Lookup tables'!E$397:X$422,MATCH(G55,'Lookup tables'!D$397:D$422,0),MATCH(State&SelectedZone&\"EFLHh\",'Lookup tables'!E$396:X$396,0))","v":{"$error":"#N/A"}},{"$f":"IFERROR(F55*T55*P55*M55/O55*U55*12/3.412,0)","v":0},{"$f":"INDEX('Lookup tables'!E$397:X$422,MATCH(G55,'Lookup tables'!D$397:D$422,0),MATCH(State&SelectedZone&\"DFs\",'Lookup tables'!E$396:X$396,0))","v":{"$error":"#N/A"}},0]
["HIDE",{"$f":"SUM(B53:B55)","v":0},{"$f":"SUM(C53:C55)","v":0},{"$f":"SUM(D53:D55)","v":0},{"$f":"SUM(E53:E55)","v":0},null,null,null,"*If unknown, reference the TX TRM 10.0 Vol 3: Table 33"]
[null,"High-Volume Low-Speed (HVLS) Fans"]
["HIDE","Peak kW","NCP kW","kWh","Uncapped Incentive","Quantity","Fan Motor Size (HP)","Airflow (CFM)",null,null,null,null,"WbaseROB/NC","Hours","W_HVLS","CF","kWh","kW"]
["HIDE",{"$f":"ROUND(R59,3)","v":0},{"$f":"B59","v":0},{"$f":"ROUND(Q59,0)","v":0},{"$f":"ROUND(IFERROR(INDEX('Savings Summary'!$P$8:$P$50,MATCH($B$57,'Savings Summary'!$C$8:$C$50,0))*D59+\nINDEX('Savings Summary'!$N$8:$N$50,MATCH($B$57,'Savings Summary'!$C$8:$C$50,0))*B59+\nINDEX('Savings Summary'!$O$8:$O$50,MATCH($B$57,'Savings Summary'!$C$8:$C$50,0))*C59,0),2)","v":0},null,null,null,null,null,null,null,{"$f":"H59/22","v":0},{"$f":"INDEX('Lookup tables'!E$426:E$431,MATCH(State&SelectedZone,'Lookup tables'!D$426:D$431,0))","v":5375},{"$f":"G59*746","v":0},1,{"$f":"IF(COUNTA(F59:H59)<3,0,F59*(M59-O59)/1000*N59)","v":0},{"$f":"IF(COUNTA(F59:H59)<3,0,F59*(M59-O59)/1000*P59)","v":0}]
["HIDE",{"$f":"ROUND(R60,3)","v":0},{"$f":"B60","v":0},{"$f":"ROUND(Q60,0)","v":0},{"$f":"ROUND(IFERROR(INDEX('Savings Summary'!$P$8:$P$50,MATCH($B$57,'Savings Summary'!$C$8:$C$50,0))*D60+\nINDEX('Savings Summary'!$N$8:$N$50,MATCH($B$57,'Savings Summary'!$C$8:$C$50,0))*B60+\nINDEX('Savings Summary'!$O$8:$O$50,MATCH($B$57,'Savings Summary'!$C$8:$C$50,0))*C60,0),2)","v":0},null,null,null,null,null,null,null,{"$f":"H60/22","v":0},{"$f":"INDEX('Lookup tables'!E$426:E$431,MATCH(State&SelectedZone,'Lookup tables'!D$426:D$431,0))","v":5375},{"$f":"G60*746","v":0},1,{"$f":"IF(COUNTA(F60:H60)<3,0,F60*(M60-O60)/1000*N60)","v":0},{"$f":"IF(COUNTA(F60:H60)<3,0,F60*(M60-O60)/1000*P60)","v":0}]
["HIDE",0,0,0,{"$f":"ROUND(IFERROR(INDEX('Savings Summary'!$P$8:$P$50,MATCH($B$57,'Savings Summary'!$C$8:$C$50,0))*D61+\nINDEX('Savings Summary'!$N$8:$N$50,MATCH($B$57,'Savings Summary'!$C$8:$C$50,0))*B61+\nINDEX('Savings Summary'!$O$8:$O$50,MATCH($B$57,'Savings Summary'!$C$8:$C$50,0))*C61,0),2)","v":0},null,null,null,null,null,null,null,{"$f":"H61/22","v":0},{"$f":"INDEX('Lookup tables'!E$426:E$431,MATCH(State&SelectedZone,'Lookup tables'!D$426:D$431,0))","v":5375},{"$f":"G61*746","v":0},1,{"$f":"IF(COUNTA(F61:H61)<3,0,F61*(M61-O61)/1000*N61)","v":0},{"$f":"IF(COUNTA(F61:H61)<3,0,F61*(M61-O61)/1000*P61)","v":0}]
["HIDE",{"$f":"SUM(B59:B61)","v":0},{"$f":"SUM(C59:C61)","v":0},{"$f":"SUM(D59:D61)","v":0},{"$f":"SUM(E59:E61)","v":0}]
[null,"ECM or VFD for Computer Room Air Handlers"]
["HIDE","Peak kW","NCP kW","kWh","Uncapped Incentive","Quantity","Existing Motor Size (HP)","Efficient Motor Size (HP)\n(if different from existing)",null,null,null,null,"kWpre","kW/\nHPpost","HPpost","LF","eff","Hours","CF","kWh","kW"]
["HIDE",{"$f":"ROUND(U65,3)","v":0},{"$f":"B65","v":0},{"$f":"ROUND(T65,0)","v":0},{"$f":"ROUND(IFERROR(INDEX('Savings Summary'!$P$8:$P$50,MATCH($B$63,'Savings Summary'!$C$8:$C$50,0))*D65+\nINDEX('Savings Summary'!$N$8:$N$50,MATCH($B$63,'Savings Summary'!$C$8:$C$50,0))*B65+\nINDEX('Savings Summary'!$O$8:$O$50,MATCH($B$63,'Savings Summary'!$C$8:$C$50,0))*C65,0),2)","v":0},null,null,null,null,null,null,null,{"$f":"0.746*G65*P65/Q65","v":{"$error":"#N/A"}},0.27,{"$f":"IF(H65=\"\",G65,H65)","v":0},0.75,{"$f":"INDEX(CRAHmotoreff,1,MATCH(G65,CRAHmotorsize,0))","v":{"$error":"#N/A"}},8760,0.11,{"$f":"IFERROR((M65-N65*O65)*R65*F65,0)","v":0},{"$f":"T65/R65*S65","v":0}]
["HIDE",{"$f":"ROUND(U66,3)","v":0},{"$f":"B66","v":0},{"$f":"ROUND(T66,0)","v":0},{"$f":"ROUND(IFERROR(INDEX('Savings Summary'!$P$8:$P$50,MATCH($B$63,'Savings Summary'!$C$8:$C$50,0))*D66+\nINDEX('Savings Summary'!$N$8:$N$50,MATCH($B$63,'Savings Summary'!$C$8:$C$50,0))*B66+\nINDEX('Savings Summary'!$O$8:$O$50,MATCH($B$63,'Savings Summary'!$C$8:$C$50,0))*C66,0),2)","v":0},null,null,null,null,null,null,null,{"$f":"0.746*G66*P66/Q66","v":{"$error":"#N/A"}},0.27,{"$f":"IF(H66=\"\",G66,H66)","v":0},0.75,{"$f":"INDEX(CRAHmotoreff,1,MATCH(G66,CRAHmotorsize,0))","v":{"$error":"#N/A"}},8760,0.11,{"$f":"IFERROR((M66-N66*O66)*R66*F66,0)","v":0},{"$f":"T66/R66*S66","v":0}]
["HIDE",0,0,0,{"$f":"ROUND(IFERROR(INDEX('Savings Summary'!$P$8:$P$50,MATCH($B$63,'Savings Summary'!$C$8:$C$50,0))*D67+\nINDEX('Savings Summary'!$N$8:$N$50,MATCH($B$63,'Savings Summary'!$C$8:$C$50,0))*B67+\nINDEX('Savings Summary'!$O$8:$O$50,MATCH($B$63,'Savings Summary'!$C$8:$C$50,0))*C67,0),2)","v":0},null,null,null,null,null,null,null,{"$f":"0.746*G67*P67/Q67","v":{"$error":"#N/A"}},0.27,{"$f":"IF(H67=\"\",G67,H67)","v":0},0.75,{"$f":"INDEX(CRAHmotoreff,1,MATCH(G67,CRAHmotorsize,0))","v":{"$error":"#N/A"}},8760,0.11,{"$f":"IFERROR((M67-N67*O67)*R67*F67,0)","v":0},0]
["HIDE",{"$f":"SUM(B65:B67)","v":0},{"$f":"SUM(C65:C67)","v":0},{"$f":"SUM(D65:D67)","v":0},{"$f":"SUM(E65:E67)","v":0}]

{"sheet":"Motors","index":7,"n_rows":36,"n_cols":35,"rows_kept":36,"cut":false,"hidden":true,"merged":[[16,21,17,21],[16,13,17,13],[16,14,17,14],[16,15,17,15],[16,22,17,22],[16,16,17,16],[16,17,17,17],[16,18,17,18],[16,19,17,19],[16,20,17,20]]}
[null,"Motors & Related Measures",null,null,null,null,null,null,null,null,null,null,null,"HIDE","HIDE","HIDE","HIDE","HIDE","HIDE","HIDE","HIDE","HIDE","HIDE","HIDE","HIDE","HIDE","HIDE","HIDE","HIDE","HIDE","HIDE","HIDE","HIDE","HIDE","HIDE"]
[null,"Click on headings to expand or collapse sections. Blue Peak kW values indicate winter peak."]
[null,"ENERGY STAR Commercial Pool Pumps"]
["HIDE","Peak kW","NCP kW","kWh","Uncapped Incentive","Pump Quantity","Rated Pump hp (New)","Pool Operation"]
["HIDE",{"$f":"ROUND(IFERROR(INDEX('Lookup tables'!H$442:J$446,MATCH(Motors!G5,PoolPumpMotorSize,0),MATCH(Motors!H5,PoolPumpOperation,0))*Motors!F5,0),3)","v":0},{"$f":"B5","v":0},{"$f":"ROUND(IFERROR(INDEX('Lookup tables'!E$442:G$446,MATCH(Motors!G5,PoolPumpMotorSize,0),MATCH(Motors!H5,PoolPumpOperation,0))*Motors!F5,0),0)","v":0},{"$f":"ROUND(IFERROR(INDEX('Savings Summary'!$P$8:$P$50,MATCH($B$3,'Savings Summary'!$C$8:$C$50,0))*D5+\nINDEX('Savings Summary'!$N$8:$N$50,MATCH($B$3,'Savings Summary'!$C$8:$C$50,0))*B5+\nINDEX('Savings Summary'!$O$8:$O$50,MATCH($B$3,'Savings Summary'!$C$8:$C$50,0))*C5,0),2)","v":0}]
["HIDE",{"$f":"ROUND(IFERROR(INDEX('Lookup tables'!H$442:J$446,MATCH(Motors!G6,PoolPumpMotorSize,0),MATCH(Motors!H6,PoolPumpOperation,0))*Motors!F6,0),3)","v":0},{"$f":"B6","v":0},{"$f":"ROUND(IFERROR(INDEX('Lookup tables'!E$442:G$446,MATCH(Motors!G6,PoolPumpMotorSize,0),MATCH(Motors!H6,PoolPumpOperation,0))*Motors!F6,0),0)","v":0},{"$f":"ROUND(IFERROR(INDEX('Savings Summary'!$P$8:$P$50,MATCH($B$3,'Savings Summary'!$C$8:$C$50,0))*D6+\nINDEX('Savings Summary'!$N$8:$N$50,MATCH($B$3,'Savings Summary'!$C$8:$C$50,0))*B6+\nINDEX('Savings Summary'!$O$8:$O$50,MATCH($B$3,'Savings Summary'!$C$8:$C$50,0))*C6,0),2)","v":0}]
["HIDE",{"$f":"ROUND(IFERROR(INDEX('Lookup tables'!H$442:J$446,MATCH(Motors!G7,PoolPumpMotorSize,0),MATCH(Motors!H7,PoolPumpOperation,0))*Motors!F7,0),3)","v":0},0,{"$f":"ROUND(IFERROR(INDEX('Lookup tables'!E$442:G$446,MATCH(Motors!G7,PoolPumpMotorSize,0),MATCH(Motors!H7,PoolPumpOperation,0))*Motors!F7,0),0)","v":0},{"$f":"ROUND(IFERROR(INDEX('Savings Summary'!$P$8:$P$50,MATCH($B$3,'Savings Summary'!$C$8:$C$50,0))*D7+\nINDEX('Savings Summary'!$N$8:$N$50,MATCH($B$3,'Savings Summary'!$C$8:$C$50,0))*B7+\nINDEX('Savings Summary'!$O$8:$O$50,MATCH($B$3,'Savings Summary'!$C$8:$C$50,0))*C7,0),2)","v":0}]
["HIDE",{"$f":"SUM(B5:B7)","v":0},{"$f":"SUM(C5:C7)","v":0},{"$f":"SUM(D5:D7)","v":0},{"$f":"SUM(E5:E7)","v":0}]
[null,"Premium Efficiency Motors"]
["HIDE","Peak kW","NCP kW","kWh","Uncapped Incentive","Motor Quantity","Application","Replacement Type","Age of Existing Motor (Years)\n(Early Retirement Only)","New Motor Size (HP)*","New Motor Type","New Motor Efficiency",null,"LF","Hrs","CF","n_ER","kWh_ER","kW_ER","n_ROB","kWh_ROB","kW_ROB","RUL (1T)","EUL","Years 2T","NPV kW 1T","NPV kW 2T","NPV kW Total","NPV kW EUL","kW","NPV kWh 1T","NPV kWh 2T","NPV kWh Total","NPV kWh EUL","kWh"]
["HIDE",{"$f":"ROUND(IFERROR(IF(H11=\"Early Retirement\",AD11,V11),0),3)","v":0},{"$f":"B11","v":0},{"$f":"ROUND(IFERROR(IF(H11=\"Early Retirement\",AI11,U11),0),0)","v":0},{"$f":"ROUND(IFERROR(INDEX('Savings Summary'!$P$8:$P$50,MATCH($B$9,'Savings Summary'!$C$8:$C$50,0))*D11+\nINDEX('Savings Summary'!$N$8:$N$50,MATCH($B$9,'Savings Summary'!$C$8:$C$50,0))*B11+\nINDEX('Savings Summary'!$O$8:$O$50,MATCH($B$9,'Savings Summary'!$C$8:$C$50,0))*C11,0),2)","v":0},null,null,null,null,null,null,null,null,{"$f":"INDEX('Lookup tables'!E$451:P$464,MATCH(Motors!G11,MotorApplications,0),MATCH(Motors!J11,'Lookup tables'!E450:J450,1))","v":{"$error":"#N/A"}},{"$f":"INDEX('Lookup tables'!K$451:P$464,MATCH(Motors!G11,MotorApplications,0),MATCH(Motors!J11,'Lookup tables'!E450:J450,1))","v":{"$error":"#N/A"}},1,{"$f":"INDEX('Lookup tables'!K$469:P$493,MATCH(Motors!J11,MotorHP,0),MATCH(Motors!K11,MotorType,0))","v":{"$error":"#N/A"}},{"$f":"F11*J11*0.746*N11*(1/Q11-1/L11)*O11","v":{"$error":"#N/A"}},{"$f":"(R11/IF(IFERROR(SEARCH(\"Industrial\",G11)>0,FALSE),8760,O11))*P11","v":{"$error":"#N/A"}},{"$f":"INDEX(NEMAtable,MATCH(Motors!J11,MotorHP,0),MATCH(Motors!K11,MotorType,0))","v":{"$error":"#N/A"}},{"$f":"F11*J11*0.746*N11*(1/T11-1/L11)*O11","v":{"$error":"#N/A"}},{"$f":"(U11/IF(IFERROR(SEARCH(\"Industrial\",G11)>0,FALSE),8760,O11))*P11","v":{"$error":"#N/A"}},{"$f":"INDEX(MotorRUL,MATCH(I11,MotorAge,0))","v":{"$error":"#N/A"}},15,{"$f":"X11-W11","v":{"$error":"#N/A"}},{"$f":"ACkW*(1+e)/(d-e)*(1-((1+e)/(1+d))^W11)*S11","v":{"$error":"#N/A"}},{"$f":"ACkW*(1+e)/(d-e)*(1-((1+e)/(1+d))^Y11)*(1+e)^W11/(1+d)^W11*V11","v":{"$error":"#N/A"}},{"$f":"Z11+AA11","v":{"$error":"#N/A"}},{"$f":"ACkW*(1+e)/(d-e)*(1-((1+e)/(1+d))^X11)","v":1873.8766012870719},{"$f":"AB11/AC11","v":{"$error":"#N/A"}},{"$f":"ACkWh*(1+e)/(d-e)*(1-((1+e)/(1+d))^W11)*R11","v":{"$error":"#N/A"}},{"$f":"ACkWh*(1+e)/(d-e)*(1-((1+e)/(1+d))^Y11)*(1+e)^W11/(1+d)^W11*U11","v":{"$error":"#N/A"}},{"$f":"AE11+AF11","v":{"$error":"#N/A"}},{"$f":"ACkWh*(1+e)/(d-e)*(1-((1+e)/(1+d))^X11)","v":2.6609047738276423},{"$f":"AG11/AH11","v":{"$error":"#N/A"}}]
["HIDE",{"$f":"ROUND(IFERROR(IF(H12=\"Early Retirement\",AD12,V12),0),3)","v":0},{"$f":"B12","v":0},{"$f":"ROUND(IFERROR(IF(H12=\"Early Retirement\",AI12,U12),0),0)","v":0},{"$f":"ROUND(IFERROR(INDEX('Savings Summary'!$P$8:$P$50,MATCH($B$9,'Savings Summary'!$C$8:$C$50,0))*D12+\nINDEX('Savings Summary'!$N$8:$N$50,MATCH($B$9,'Savings Summary'!$C$8:$C$50,0))*B12+\nINDEX('Savings Summary'!$O$8:$O$50,MATCH($B$9,'Savings Summary'!$C$8:$C$50,0))*C12,0),2)","v":0},null,null,null,null,null,null,null,null,{"$f":"INDEX('Lookup tables'!E$451:P$464,MATCH(Motors!G12,MotorApplications,0),MATCH(Motors!J12,'Lookup tables'!E451:J451,1))","v":{"$error":"#N/A"}},{"$f":"INDEX('Lookup tables'!K$451:P$464,MATCH(Motors!G12,MotorApplications,0),MATCH(Motors!J12,'Lookup tables'!E451:J451,1))","v":{"$error":"#N/A"}},1,{"$f":"INDEX('Lookup tables'!K$469:P$493,MATCH(Motors!J12,MotorHP,0),MATCH(Motors!K12,MotorType,0))","v":{"$error":"#N/A"}},{"$f":"F12*J12*0.746*N12*(1/Q12-1/L12)*O12","v":{"$error":"#N/A"}},{"$f":"(R12/IF(IFERROR(SEARCH(\"Industrial\",G12)>0,FALSE),8760,O12))*P12","v":{"$error":"#N/A"}},{"$f":"INDEX(NEMAtable,MATCH(Motors!J12,MotorHP,0),MATCH(Motors!K12,MotorType,0))","v":{"$error":"#N/A"}},{"$f":"F12*J12*0.746*N12*(1/T12-1/L12)*O12","v":{"$error":"#N/A"}},{"$f":"(U12/IF(IFERROR(SEARCH(\"Industrial\",G12)>0,FALSE),8760,O12))*P12","v":{"$error":"#N/A"}},{"$f":"INDEX(MotorRUL,MATCH(I12,MotorAge,0))","v":{"$error":"#N/A"}},16,{"$f":"X12-W12","v":{"$error":"#N/A"}},{"$f":"ACkW*(1+e)/(d-e)*(1-((1+e)/(1+d))^W12)*S12","v":{"$error":"#N/A"}},{"$f":"ACkW*(1+e)/(d-e)*(1-((1+e)/(1+d))^Y12)*(1+e)^W12/(1+d)^W12*V12","v":{"$error":"#N/A"}},{"$f":"Z12+AA12","v":{"$error":"#N/A"}},{"$f":"ACkW*(1+e)/(d-e)*(1-((1+e)/(1+d))^X12)","v":2059.2173680105802},{"$f":"AB12/AC12","v":{"$error":"#N/A"}},{"$f":"ACkWh*(1+e)/(d-e)*(1-((1+e)/(1+d))^W12)*R12","v":{"$error":"#N/A"}},{"$f":"ACkWh*(1+e)/(d-e)*(1-((1+e)/(1+d))^Y12)*(1+e)^W12/(1+d)^W12*U12","v":{"$error":"#N/A"}},{"$f":"AE12+AF12","v":{"$error":"#N/A"}},{"$f":"ACkWh*(1+e)/(d-e)*(1-((1+e)/(1+d))^X12)","v":2.924088662575024},{"$f":"AG12/AH12","v":{"$error":"#N/A"}}]
["HIDE",0,0,0,{"$f":"ROUND(IFERROR(INDEX('Savings Summary'!$P$8:$P$50,MATCH($B$9,'Savings Summary'!$C$8:$C$50,0))*D13+\nINDEX('Savings Summary'!$N$8:$N$50,MATCH($B$9,'Savings Summary'!$C$8:$C$50,0))*B13+\nINDEX('Savings Summary'!$O$8:$O$50,MATCH($B$9,'Savings Summary'!$C$8:$C$50,0))*C13,0),2)","v":0},null,null,null,null,null,null,null,null,{"$f":"INDEX('Lookup tables'!E$451:P$464,MATCH(Motors!G13,MotorApplications,0),MATCH(Motors!J13,'Lookup tables'!E452:J452,1))","v":{"$error":"#N/A"}},{"$f":"INDEX('Lookup tables'!K$451:P$464,MATCH(Motors!G13,MotorApplications,0),MATCH(Motors!J13,'Lookup tables'!E452:J452,1))","v":{"$error":"#N/A"}},1,{"$f":"INDEX('Lookup tables'!K$469:P$493,MATCH(Motors!J13,MotorHP,0),MATCH(Motors!K13,MotorType,0))","v":{"$error":"#N/A"}},{"$error":"#N/A"},{"$error":"#N/A"},{"$f":"INDEX(NEMAtable,MATCH(Motors!J13,MotorHP,0),MATCH(Motors!K13,MotorType,0))","v":{"$error":"#N/A"}},{"$error":"#N/A"},{"$error":"#N/A"},{"$f":"INDEX(MotorRUL,MATCH(I13,MotorAge,0))","v":{"$error":"#N/A"}},17,{"$error":"#N/A"},{"$f":"ACkW*(1+e)/(d-e)*(1-((1+e)/(1+d))^W13)*S13","v":{"$error":"#N/A"}},{"$f":"ACkW*(1+e)/(d-e)*(1-((1+e)/(1+d))^Y13)*(1+e)^W13/(1+d)^W13*V13","v":{"$error":"#N/A"}},{"$error":"#N/A"},{"$f":"ACkW*(1+e)/(d-e)*(1-((1+e)/(1+d))^X13)","v":2254.5505459533624},{"$error":"#N/A"},{"$f":"ACkWh*(1+e)/(d-e)*(1-((1+e)/(1+d))^W13)*R13","v":{"$error":"#N/A"}},{"$f":"ACkWh*(1+e)/(d-e)*(1-((1+e)/(1+d))^Y13)*(1+e)^W13/(1+d)^W13*U13","v":{"$error":"#N/A"}},{"$error":"#N/A"},{"$f":"ACkWh*(1+e)/(d-e)*(1-((1+e)/(1+d))^X13)","v":3.2014617752537746},{"$error":"#N/A"}]
["HIDE",0,0,0,{"$f":"ROUND(IFERROR(INDEX('Savings Summary'!$P$8:$P$50,MATCH($B$9,'Savings Summary'!$C$8:$C$50,0))*D14+\nINDEX('Savings Summary'!$N$8:$N$50,MATCH($B$9,'Savings Summary'!$C$8:$C$50,0))*B14+\nINDEX('Savings Summary'!$O$8:$O$50,MATCH($B$9,'Savings Summary'!$C$8:$C$50,0))*C14,0),2)","v":0},null,null,null,null,null,null,null,null,{"$f":"INDEX('Lookup tables'!E$451:P$464,MATCH(Motors!G14,MotorApplications,0),MATCH(Motors!J14,'Lookup tables'!E453:J453,1))","v":{"$error":"#N/A"}},{"$f":"INDEX('Lookup tables'!K$451:P$464,MATCH(Motors!G14,MotorApplications,0),MATCH(Motors!J14,'Lookup tables'!E453:J453,1))","v":{"$error":"#N/A"}},1,{"$f":"INDEX('Lookup tables'!K$469:P$493,MATCH(Motors!J14,MotorHP,0),MATCH(Motors!K14,MotorType,0))","v":{"$error":"#N/A"}},{"$error":"#N/A"},{"$error":"#N/A"},{"$f":"INDEX(NEMAtable,MATCH(Motors!J14,MotorHP,0),MATCH(Motors!K14,MotorType,0))","v":{"$error":"#N/A"}},{"$error":"#N/A"},{"$error":"#N/A"},{"$f":"INDEX(MotorRUL,MATCH(I14,MotorAge,0))","v":{"$error":"#N/A"}},18,{"$error":"#N/A"},{"$f":"ACkW*(1+e)/(d-e)*(1-((1+e)/(1+d))^W14)*S14","v":{"$error":"#N/A"}},{"$f":"ACkW*(1+e)/(d-e)*(1-((1+e)/(1+d))^Y14)*(1+e)^W14/(1+d)^W14*V14","v":{"$error":"#N/A"}},{"$error":"#N/A"},{"$f":"ACkW*(1+e)/(d-e)*(1-((1+e)/(1+d))^X14)","v":2460.4148632308788},{"$error":"#N/A"},{"$f":"ACkWh*(1+e)/(d-e)*(1-((1+e)/(1+d))^W14)*R14","v":{"$error":"#N/A"}},{"$f":"ACkWh*(1+e)/(d-e)*(1-((1+e)/(1+d))^Y14)*(1+e)^W14/(1+d)^W14*U14","v":{"$error":"#N/A"}},{"$error":"#N/A"},{"$f":"ACkWh*(1+e)/(d-e)*(1-((1+e)/(1+d))^X14)","v":3.4937891057878478},{"$error":"#N/A"}]
["HIDE",0,0,0,{"$f":"ROUND(IFERROR(INDEX('Savings Summary'!$P$8:$P$50,MATCH($B$9,'Savings Summary'!$C$8:$C$50,0))*D15+\nINDEX('Savings Summary'!$N$8:$N$50,MATCH($B$9,'Savings Summary'!$C$8:$C$50,0))*B15+\nINDEX('Savings Summary'!$O$8:$O$50,MATCH($B$9,'Savings Summary'!$C$8:$C$50,0))*C15,0),2)","v":0},null,null,null,null,null,null,null,null,{"$f":"INDEX('Lookup tables'!E$451:P$464,MATCH(Motors!G15,MotorApplications,0),MATCH(Motors!J15,'Lookup tables'!E454:J454,1))","v":{"$error":"#N/A"}},{"$f":"INDEX('Lookup tables'!K$451:P$464,MATCH(Motors!G15,MotorApplications,0),MATCH(Motors!J15,'Lookup tables'!E454:J454,1))","v":{"$error":"#N/A"}},1,{"$f":"INDEX('Lookup tables'!K$469:P$493,MATCH(Motors!J15,MotorHP,0),MATCH(Motors!K15,MotorType,0))","v":{"$error":"#N/A"}},{"$error":"#N/A"},{"$error":"#N/A"},{"$f":"INDEX(NEMAtable,MATCH(Motors!J15,MotorHP,0),MATCH(Motors!K15,MotorType,0))","v":{"$error":"#N/A"}},{"$error":"#N/A"},{"$error":"#N/A"},{"$f":"INDEX(MotorRUL,MATCH(I15,MotorAge,0))","v":{"$error":"#N/A"}},19,{"$error":"#N/A"},{"$f":"ACkW*(1+e)/(d-e)*(1-((1+e)/(1+d))^W15)*S15","v":{"$error":"#N/A"}},{"$f":"ACkW*(1+e)/(d-e)*(1-((1+e)/(1+d))^Y15)*(1+e)^W15/(1+d)^W15*V15","v":{"$error":"#N/A"}},{"$error":"#N/A"},{"$f":"ACkW*(1+e)/(d-e)*(1-((1+e)/(1+d))^X15)","v":2677.3780927983221},{"$error":"#N/A"},{"$f":"ACkWh*(1+e)/(d-e)*(1-((1+e)/(1+d))^W15)*R15","v":{"$error":"#N/A"}},{"$f":"ACkWh*(1+e)/(d-e)*(1-((1+e)/(1+d))^Y15)*(1+e)^W15/(1+d)^W15*U15","v":{"$error":"#N/A"}},{"$error":"#N/A"},{"$f":"ACkWh*(1+e)/(d-e)*(1-((1+e)/(1+d))^X15)","v":3.8018768917736172},{"$error":"#N/A"}]
["HIDE",{"$f":"SUM(B11:B15)","v":0},{"$f":"SUM(C11:C15)","v":0},0,{"$f":"SUM(E11:E15)","v":0},null,null,null,null,"*Round down if exact size is not available."]
[null,"Pump-Off Controllers",null,null,null,null,null,null,null,null,null,null,null,"NEMA eff","Baseline Energy Usage (kWh)","Baseline Demand (kW)","Baseline Operating Hours (Hours)","Efficient Energy Usage (kWh)","Efficient Demand (kW)","Efficient Operating Hours (Hours)","Efficient Hours Adjustment Factor","Customer Energy Savings(kWh)","Peak Coincident Savings (PCkW)"]
["HIDE","Peak kW","NCP kW","kWh","Uncapped Incentive","Motor Quantity","Motor Size (HP)","Motor Type","Volumetric Efficiency (%)"]
["HIDE",{"$f":"ROUND(IFERROR(IF(I19=\"\",0,W19),0),3)","v":0},{"$f":"ROUND(IFERROR(W19,0),3)","v":0},{"$f":"ROUND(IFERROR(IF(I19=\"\",0,V19),0),0)","v":0},{"$f":"ROUND(IFERROR(INDEX('Savings Summary'!$P$8:$P$50,MATCH($B$17,'Savings Summary'!$C$8:$C$50,0))*D19+\nINDEX('Savings Summary'!$N$8:$N$50,MATCH($B$17,'Savings Summary'!$C$8:$C$50,0))*B19+\nINDEX('Savings Summary'!$O$8:$O$50,MATCH($B$17,'Savings Summary'!$C$8:$C$50,0))*C19,0),2)","v":0},null,null,null,null,null,null,null,null,{"$f":"INDEX(NEMAtable,MATCH(Motors!G19,MotorHP,0),MATCH(Motors!H19,MotorType,0))","v":{"$error":"#N/A"}},{"$f":"P19*Q19","v":{"$error":"#N/A"}},{"$f":"F19*G19*'Lookup tables'!$E$518*'Lookup tables'!$E$519/N19/'Lookup tables'!$E$520","v":{"$error":"#N/A"}},{"$f":"'Lookup tables'!$E$521*'Lookup tables'!$E$522","v":5694},{"$f":"S19*T19","v":{"$error":"#N/A"}},{"$f":"P19","v":{"$error":"#N/A"}},{"$f":"U19*'Lookup tables'!$E$522","v":730.23360000000002},{"$f":"('Lookup tables'!$E$523+'Lookup tables'!$E$524*I19*'Lookup tables'!$E$521*100)/100","v":8.3360000000000004E-2},{"$f":"O19-R19","v":{"$error":"#N/A"}},{"$f":"V19/8760","v":{"$error":"#N/A"}}]
["HIDE",{"$f":"ROUND(IFERROR(IF(I20=\"\",0,W20),0),3)","v":0},{"$f":"ROUND(IFERROR(W20,0),3)","v":0},{"$f":"ROUND(IFERROR(IF(I20=\"\",0,V20),0),0)","v":0},{"$f":"ROUND(IFERROR(INDEX('Savings Summary'!$P$8:$P$50,MATCH($B$17,'Savings Summary'!$C$8:$C$50,0))*D20+\nINDEX('Savings Summary'!$N$8:$N$50,MATCH($B$17,'Savings Summary'!$C$8:$C$50,0))*B20+\nINDEX('Savings Summary'!$O$8:$O$50,MATCH($B$17,'Savings Summary'!$C$8:$C$50,0))*C20,0),2)","v":0},null,null,null,null,null,null,null,null,{"$f":"INDEX(NEMAtable,MATCH(Motors!G20,MotorHP,0),MATCH(Motors!H20,MotorType,0))","v":{"$error":"#N/A"}},{"$f":"P20*Q20","v":{"$error":"#N/A"}},{"$f":"F20*G20*'Lookup tables'!$E$518*'Lookup tables'!$E$519/N20/'Lookup tables'!$E$520","v":{"$error":"#N/A"}},{"$f":"'Lookup tables'!$E$521*'Lookup tables'!$E$522","v":5694},{"$f":"S20*T20","v":{"$error":"#N/A"}},{"$f":"P20","v":{"$error":"#N/A"}},{"$f":"U20*'Lookup tables'!$E$522","v":730.23360000000002},{"$f":"('Lookup tables'!$E$523+'Lookup tables'!$E$524*I20*'Lookup tables'!$E$521*100)/100","v":8.3360000000000004E-2},{"$f":"O20-R20","v":{"$error":"#N/A"}},{"$f":"V20/8760","v":{"$error":"#N/A"}}]
["HIDE",0,0,0,{"$f":"ROUND(IFERROR(INDEX('Savings Summary'!$P$8:$P$50,MATCH($B$17,'Savings Summary'!$C$8:$C$50,0))*D21+\nINDEX('Savings Summary'!$N$8:$N$50,MATCH($B$17,'Savings Summary'!$C$8:$C$50,0))*B21+\nINDEX('Savings Summary'!$O$8:$O$50,MATCH($B$17,'Savings Summary'!$C$8:$C$50,0))*C21,0),2)","v":0},null,null,null,null,null,null,null,null,{"$f":"INDEX(NEMAtable,MATCH(Motors!G21,MotorHP,0),MATCH(Motors!H21,MotorType,0))","v":{"$error":"#N/A"}},{"$error":"#N/A"},{"$f":"F21*G21*'Lookup tables'!$E$518*'Lookup tables'!$E$519/N21/'Lookup tables'!$E$520","v":{"$error":"#N/A"}},{"$f":"'Lookup tables'!$E$521*'Lookup tables'!$E$522","v":5694},{"$error":"#N/A"},{"$error":"#N/A"},{"$f":"U21*'Lookup tables'!$E$522","v":730.23360000000002},{"$f":"('Lookup tables'!$E$523+'Lookup tables'!$E$524*I21*'Lookup tables'!$E$521*100)/100","v":8.3360000000000004E-2},{"$error":"#N/A"},{"$error":"#N/A"}]
["HIDE",{"$f":"SUM(B19:B21)","v":0},{"$f":"SUM(C19:C21)","v":0},{"$f":"SUM(D19:D21)","v":0},{"$f":"SUM(E19:E21)","v":0}]
[null,"VFDs for Water Pumping"]
["HIDE","Peak kW","NCP kW","kWh","Uncapped Incentive","Motor Quantity","Motor Size (HP)"]
["HIDE",{"$f":"ROUND(IFERROR(INDEX('Lookup tables'!$F$783:$F$788,MATCH(State&SelectedZone,'Lookup tables'!$D$783:$D$788,0))*F25*G25,0),3)","v":0},{"$f":"B25","v":0},{"$f":"ROUND(IFERROR(INDEX('Lookup tables'!$E$783:$E$788,MATCH(State&SelectedZone,'Lookup tables'!$D$783:$D$788,0))*F25*G25,0),0)","v":0},{"$f":"ROUND(IFERROR(INDEX('Savings Summary'!$P$8:$P$50,MATCH($B$23,'Savings Summary'!$C$8:$C$50,0))*D25+\nINDEX('Savings Summary'!$N$8:$N$50,MATCH($B$23,'Savings Summary'!$C$8:$C$50,0))*B25+\nINDEX('Savings Summary'!$O$8:$O$50,MATCH($B$23,'Savings Summary'!$C$8:$C$50,0))*C25,0),2)","v":0}]
["HIDE",{"$f":"ROUND(IFERROR(INDEX('Lookup tables'!$F$783:$F$788,MATCH(State&SelectedZone,'Lookup tables'!$D$783:$D$788,0))*F26*G26,0),3)","v":0},{"$f":"B26","v":0},{"$f":"ROUND(IFERROR(INDEX('Lookup tables'!$E$783:$E$788,MATCH(State&SelectedZone,'Lookup tables'!$D$783:$D$788,0))*F26*G26,0),0)","v":0},{"$f":"ROUND(IFERROR(INDEX('Savings Summary'!$P$8:$P$50,MATCH($B$23,'Savings Summary'!$C$8:$C$50,0))*D26+\nINDEX('Savings Summary'!$N$8:$N$50,MATCH($B$23,'Savings Summary'!$C$8:$C$50,0))*B26+\nINDEX('Savings Summary'!$O$8:$O$50,MATCH($B$23,'Savings Summary'!$C$8:$C$50,0))*C26,0),2)","v":0}]
["HIDE",{"$f":"ROUND(IFERROR(INDEX('Lookup tables'!$F$783:$F$788,MATCH(State&SelectedZone,'Lookup tables'!$D$783:$D$788,0))*F27*G27,0),3)","v":0},0,{"$f":"ROUND(IFERROR(INDEX('Lookup tables'!$E$783:$E$788,MATCH(State&SelectedZone,'Lookup tables'!$D$783:$D$788,0))*F27*G27,0),0)","v":0},{"$f":"ROUND(IFERROR(INDEX('Savings Summary'!$P$8:$P$50,MATCH($B$23,'Savings Summary'!$C$8:$C$50,0))*D27+\nINDEX('Savings Summary'!$N$8:$N$50,MATCH($B$23,'Savings Summary'!$C$8:$C$50,0))*B27+\nINDEX('Savings Summary'!$O$8:$O$50,MATCH($B$23,'Savings Summary'!$C$8:$C$50,0))*C27,0),2)","v":0}]
["HIDE",{"$f":"SUM(B25:B27)","v":0},{"$f":"SUM(C25:C27)","v":0},{"$f":"SUM(D25:D27)","v":0},{"$f":"SUM(E25:E27)","v":0}]
[null,"Hydraulic Oils & Gear Lubricants"]
["HIDE","Peak kW","NCP kW","kWh","Uncapped Incentive","Motor Quantity","Motor Size (HP)","Equipment Type","Annual Operating Hours",null,null,null,null,"LF","n","EI"]
["HIDE",0,0,{"$f":"ROUND(IFERROR(F31*G31*N31/O31*I31*P31,0),0)","v":0},{"$f":"ROUND(IFERROR(INDEX('Savings Summary'!$P$8:$P$50,MATCH($B$29,'Savings Summary'!$C$8:$C$50,0))*D31+\nINDEX('Savings Summary'!$N$8:$N$50,MATCH($B$29,'Savings Summary'!$C$8:$C$50,0))*B31+\nINDEX('Savings Summary'!$O$8:$O$50,MATCH($B$29,'Savings Summary'!$C$8:$C$50,0))*C31,0),2)","v":0},null,null,null,null,null,null,null,null,0.75,{"$f":"INDEX(HydraulicOilMotorEfficiency,MATCH(G31,HydraulicOilMotorSize,0))","v":{"$error":"#N/A"}},{"$f":"INDEX(HydraulicOilEI,MATCH(H31,HydraulicOilEquipmentType,0))","v":{"$error":"#N/A"}}]
["HIDE",0,0,{"$f":"ROUND(IFERROR(F32*G32*N32/O32*I32*P32,0),0)","v":0},{"$f":"ROUND(IFERROR(INDEX('Savings Summary'!$P$8:$P$50,MATCH($B$29,'Savings Summary'!$C$8:$C$50,0))*D32+\nINDEX('Savings Summary'!$N$8:$N$50,MATCH($B$29,'Savings Summary'!$C$8:$C$50,0))*B32+\nINDEX('Savings Summary'!$O$8:$O$50,MATCH($B$29,'Savings Summary'!$C$8:$C$50,0))*C32,0),2)","v":0},null,null,null,null,null,null,null,null,0.75]
["HIDE",0,0,0,{"$f":"ROUND(IFERROR(INDEX('Savings Summary'!$P$8:$P$50,MATCH($B$29,'Savings Summary'!$C$8:$C$50,0))*D33+\nINDEX('Savings Summary'!$N$8:$N$50,MATCH($B$29,'Savings Summary'!$C$8:$C$50,0))*B33+\nINDEX('Savings Summary'!$O$8:$O$50,MATCH($B$29,'Savings Summary'!$C$8:$C$50,0))*C33,0),2)","v":0},null,null,null,null,null,null,null,null,0.75]
["HIDE",0,0,0,{"$f":"ROUND(IFERROR(INDEX('Savings Summary'!$P$8:$P$50,MATCH($B$29,'Savings Summary'!$C$8:$C$50,0))*D34+\nINDEX('Savings Summary'!$N$8:$N$50,MATCH($B$29,'Savings Summary'!$C$8:$C$50,0))*B34+\nINDEX('Savings Summary'!$O$8:$O$50,MATCH($B$29,'Savings Summary'!$C$8:$C$50,0))*C34,0),2)","v":0},null,null,null,null,null,null,null,null,0.75]
["HIDE",0,0,0,{"$f":"ROUND(IFERROR(INDEX('Savings Summary'!$P$8:$P$50,MATCH($B$29,'Savings Summary'!$C$8:$C$50,0))*D35+\nINDEX('Savings Summary'!$N$8:$N$50,MATCH($B$29,'Savings Summary'!$C$8:$C$50,0))*B35+\nINDEX('Savings Summary'!$O$8:$O$50,MATCH($B$29,'Savings Summary'!$C$8:$C$50,0))*C35,0),2)","v":0},null,null,null,null,null,null,null,null,0.75]
["HIDE",{"$f":"SUM(B31:B35)","v":0},{"$f":"SUM(C31:C35)","v":0},{"$f":"SUM(D31:D35)","v":0},{"$f":"SUM(E31:E35)","v":0}]

{"sheet":"Misc","index":8,"n_rows":38,"n_cols":15,"rows_kept":38,"cut":false,"hidden":false,"merged":[[37,6,37,7],[31,6,31,7],[27,7,27,8],[28,7,28,8],[29,7,29,8],[30,7,30,8]]}
[null,"Miscellaneous Measures",null,null,null,null,null,null,null,null,null,null,"HIDE","HIDE","HIDE"]
[null,"Click on headings to expand or collapse sections. Blue Peak kW values indicate winter peak."]
[null,"PC Power Management (PCPM)"]
["HIDE","Peak kW","NCP kW","kWh","Uncapped Incentive","Equipment Quantity","Equipment Type"]
["HIDE",{"$f":"ROUND(IFERROR($F5*INDEX('Lookup tables'!G$699:L$704,MATCH(Misc!G5,PCPMEquipmentType,0),MATCH(State&SelectedZone,'Lookup tables'!G$697:L$697,0)),0),3)","v":0},{"$f":"ROUND(IFERROR($F5*INDEX('Lookup tables'!M$699:M$704,MATCH(Misc!G5,PCPMEquipmentType,0)),0),3)","v":0},{"$f":"ROUND(IFERROR($F5*INDEX(IF(Utility=\"CPS\",'Lookup tables'!F$699:F$704,'Lookup tables'!E$699:E$704),MATCH(Misc!G5,PCPMEquipmentType,0)),0),0)","v":0},{"$f":"ROUND(IFERROR(INDEX('Savings Summary'!$P$8:$P$50,MATCH($B$3,'Savings Summary'!$C$8:$C$50,0))*D5+\nINDEX('Savings Summary'!$N$8:$N$50,MATCH($B$3,'Savings Summary'!$C$8:$C$50,0))*B5+\nINDEX('Savings Summary'!$O$8:$O$50,MATCH($B$3,'Savings Summary'!$C$8:$C$50,0))*C5,0),2)","v":0}]
["HIDE",{"$f":"ROUND(IFERROR($F6*INDEX('Lookup tables'!G$699:L$704,MATCH(Misc!G6,PCPMEquipmentType,0),MATCH(State&SelectedZone,'Lookup tables'!G$697:L$697,0)),0),3)","v":0},{"$f":"ROUND(IFERROR($F6*INDEX('Lookup tables'!M$699:M$704,MATCH(Misc!G6,PCPMEquipmentType,0)),0),3)","v":0},{"$f":"ROUND(IFERROR($F6*INDEX(IF(Utility=\"CPS\",'Lookup tables'!F$699:F$704,'Lookup tables'!E$699:E$704),MATCH(Misc!G6,PCPMEquipmentType,0)),0),0)","v":0},{"$f":"ROUND(IFERROR(INDEX('Savings Summary'!$P$8:$P$50,MATCH($B$3,'Savings Summary'!$C$8:$C$50,0))*D6+\nINDEX('Savings Summary'!$N$8:$N$50,MATCH($B$3,'Savings Summary'!$C$8:$C$50,0))*B6+\nINDEX('Savings Summary'!$O$8:$O$50,MATCH($B$3,'Savings Summary'!$C$8:$C$50,0))*C6,0),2)","v":0}]
["HIDE",{"$f":"ROUND(IFERROR($F7*INDEX('Lookup tables'!G$699:L$704,MATCH(Misc!G7,PCPMEquipmentType,0),MATCH(State&SelectedZone,'Lookup tables'!G$697:L$697,0)),0),3)","v":0},{"$f":"ROUND(IFERROR($F7*INDEX('Lookup tables'!M$699:M$704,MATCH(Misc!G7,PCPMEquipmentType,0)),0),3)","v":0},{"$f":"ROUND(IFERROR($F7*INDEX(IF(Utility=\"CPS\",'Lookup tables'!F$699:F$704,'Lookup tables'!E$699:E$704),MATCH(Misc!G7,PCPMEquipmentType,0)),0),0)","v":0},{"$f":"ROUND(IFERROR(INDEX('Savings Summary'!$P$8:$P$50,MATCH($B$3,'Savings Summary'!$C$8:$C$50,0))*D7+\nINDEX('Savings Summary'!$N$8:$N$50,MATCH($B$3,'Savings Summary'!$C$8:$C$50,0))*B7+\nINDEX('Savings Summary'!$O$8:$O$50,MATCH($B$3,'Savings Summary'!$C$8:$C$50,0))*C7,0),2)","v":0}]
["HIDE",{"$f":"ROUND(IFERROR($F8*INDEX('Lookup tables'!G$699:L$704,MATCH(Misc!G8,PCPMEquipmentType,0),MATCH(State&SelectedZone,'Lookup tables'!G$697:L$697,0)),0),3)","v":0},{"$f":"ROUND(IFERROR($F8*INDEX('Lookup tables'!M$699:M$704,MATCH(Misc!G8,PCPMEquipmentType,0)),0),3)","v":0},{"$f":"ROUND(IFERROR($F8*INDEX(IF(Utility=\"CPS\",'Lookup tables'!F$699:F$704,'Lookup tables'!E$699:E$704),MATCH(Misc!G8,PCPMEquipmentType,0)),0),0)","v":0},{"$f":"ROUND(IFERROR(INDEX('Savings Summary'!$P$8:$P$50,MATCH($B$3,'Savings Summary'!$C$8:$C$50,0))*D8+\nINDEX('Savings Summary'!$N$8:$N$50,MATCH($B$3,'Savings Summary'!$C$8:$C$50,0))*B8+\nINDEX('Savings Summary'!$O$8:$O$50,MATCH($B$3,'Savings Summary'!$C$8:$C$50,0))*C8,0),2)","v":0}]
["HIDE",{"$f":"SUM(B5:B8)","v":0},{"$f":"SUM(C5:C8)","v":0},{"$f":"SUM(D5:D8)","v":0},{"$f":"SUM(E5:E8)","v":0}]
[null,"ENERGY STAR Electric Vehicle Supply Equipment (EVSE)"]
["HIDE","Peak kW","NC kW","kWh","Uncapped Incentive","Quantity (#)","ENERGY STAR Level 2-Certified EVSE?","Application",null,null,null,null,"kW summer","kW winter","Summer peak?"]
["HIDE",{"$f":"ROUND(IFERROR(MAX(M12:N12),0),3)","v":0},{"$f":"B12","v":0},{"$f":"ROUND(IF(AND(COUNTA(F12:H12)=3,G12=\"Yes\"),'Lookup tables'!E$756*Misc!F12,0)*F12,0)","v":0},{"$f":"ROUND(IFERROR(INDEX('Savings Summary'!$P$8:$P$50,MATCH($B$10,'Savings Summary'!$C$8:$C$50,0))*D12+\nINDEX('Savings Summary'!$N$8:$N$50,MATCH($B$10,'Savings Summary'!$C$8:$C$50,0))*B12+\nINDEX('Savings Summary'!$O$8:$O$50,MATCH($B$10,'Savings Summary'!$C$8:$C$50,0))*C12,0),2)","v":0},null,null,null,null,null,null,null,{"$f":"IFERROR(INDEX('Lookup tables'!E$759:J$764,MATCH(State&SelectedZone,'Lookup tables'!D$759:D$764,0),(MATCH(Misc!H12,EVSEApplication,0)*2-1))*F12,0)","v":0},{"$f":"IFERROR(INDEX('Lookup tables'!E$759:J$764,MATCH(State&SelectedZone,'Lookup tables'!D$759:D$764,0),(MATCH(Misc!H12,EVSEApplication,0)*2))*F12,0)","v":0},{"$f":"M12>N12","v":false}]
["HIDE",{"$f":"ROUND(IFERROR(MAX(M13:N13),0),3)","v":0},{"$f":"B13","v":0},{"$f":"ROUND(IF(AND(COUNTA(F13:H13)=3,G13=\"Yes\"),'Lookup tables'!E$756*Misc!F13,0)*F13,0)","v":0},{"$f":"ROUND(IFERROR(INDEX('Savings Summary'!$P$8:$P$50,MATCH($B$10,'Savings Summary'!$C$8:$C$50,0))*D13+\nINDEX('Savings Summary'!$N$8:$N$50,MATCH($B$10,'Savings Summary'!$C$8:$C$50,0))*B13+\nINDEX('Savings Summary'!$O$8:$O$50,MATCH($B$10,'Savings Summary'!$C$8:$C$50,0))*C13,0),2)","v":0},null,null,null,null,null,null,null,{"$f":"IFERROR(INDEX('Lookup tables'!E$759:J$764,MATCH(State&SelectedZone,'Lookup tables'!D$759:D$764,0),(MATCH(Misc!H13,EVSEApplication,0)*2-1))*F13,0)","v":0},{"$f":"IFERROR(INDEX('Lookup tables'!E$759:J$764,MATCH(State&SelectedZone,'Lookup tables'!D$759:D$764,0),(MATCH(Misc!H13,EVSEApplication,0)*2))*F13,0)","v":0},{"$f":"M13>N13","v":false}]
["HIDE",0,0,{"$f":"ROUND(IF(AND(COUNTA(F14:H14)=3,G14=\"Yes\"),'Lookup tables'!E$756*Misc!F14,0)*F14,0)","v":0},{"$f":"ROUND(IFERROR(INDEX('Savings Summary'!$P$8:$P$50,MATCH($B$10,'Savings Summary'!$C$8:$C$50,0))*D14+\nINDEX('Savings Summary'!$N$8:$N$50,MATCH($B$10,'Savings Summary'!$C$8:$C$50,0))*B14+\nINDEX('Savings Summary'!$O$8:$O$50,MATCH($B$10,'Savings Summary'!$C$8:$C$50,0))*C14,0),2)","v":0},null,null,null,null,null,null,null,{"$f":"IFERROR(INDEX('Lookup tables'!E$759:J$764,MATCH(State&SelectedZone,'Lookup tables'!D$759:D$764,0),(MATCH(Misc!H14,EVSEApplication,0)*2-1))*F14,0)","v":0},{"$f":"IFERROR(INDEX('Lookup tables'!E$759:J$764,MATCH(State&SelectedZone,'Lookup tables'!D$759:D$764,0),(MATCH(Misc!H14,EVSEApplication,0)*2))*F14,0)","v":0},{"$f":"M14>N14","v":false}]
["HIDE",{"$f":"SUM(B12:B14)","v":0},{"$f":"SUM(C12:C14)","v":0},{"$f":"SUM(D12:D14)","v":0},{"$f":"SUM(E12:E14)","v":0},null,null,null,null,null,null,null,{"$f":"SUMIF(O12:O14,TRUE,M12:M14)","v":0},{"$f":"SUMIF(O12:O14,FALSE,N12:N14)","v":0},{"$f":"M15>N15","v":false}]
[null,"LED Traffic Signals"]
["HIDE","Peak kW","NC kW","kWh","Uncapped Incentive","Quantity (#)","Fixture Type"]
["HIDE",{"$f":"ROUND(IFERROR(INDEX('Lookup tables'!E$767:E$780,MATCH(Misc!$G18,LEDTrafficSignalType,0))*Misc!$F18,0),3)","v":0},{"$f":"B18","v":0},{"$f":"ROUND(IFERROR(INDEX('Lookup tables'!F$767:F$780,MATCH(Misc!$G18,LEDTrafficSignalType,0))*Misc!$F18,0),0)","v":0},{"$f":"ROUND(IFERROR(INDEX('Savings Summary'!$P$8:$P$50,MATCH($B$16,'Savings Summary'!$C$8:$C$50,0))*D18+\nINDEX('Savings Summary'!$N$8:$N$50,MATCH($B$16,'Savings Summary'!$C$8:$C$50,0))*B18+\nINDEX('Savings Summary'!$O$8:$O$50,MATCH($B$16,'Savings Summary'!$C$8:$C$50,0))*C18,0),2)","v":0}]
["HIDE",{"$f":"ROUND(IFERROR(INDEX('Lookup tables'!E$767:E$780,MATCH(Misc!$G19,LEDTrafficSignalType,0))*Misc!$F19,0),3)","v":0},{"$f":"B19","v":0},{"$f":"ROUND(IFERROR(INDEX('Lookup tables'!F$767:F$780,MATCH(Misc!$G19,LEDTrafficSignalType,0))*Misc!$F19,0),0)","v":0},{"$f":"ROUND(IFERROR(INDEX('Savings Summary'!$P$8:$P$50,MATCH($B$16,'Savings Summary'!$C$8:$C$50,0))*D19+\nINDEX('Savings Summary'!$N$8:$N$50,MATCH($B$16,'Savings Summary'!$C$8:$C$50,0))*B19+\nINDEX('Savings Summary'!$O$8:$O$50,MATCH($B$16,'Savings Summary'!$C$8:$C$50,0))*C19,0),2)","v":0}]
["HIDE",{"$f":"ROUND(IFERROR(INDEX('Lookup tables'!E$767:E$780,MATCH(Misc!$G20,LEDTrafficSignalType,0))*Misc!$F20,0),3)","v":0},0,{"$f":"ROUND(IFERROR(INDEX('Lookup tables'!F$767:F$780,MATCH(Misc!$G20,LEDTrafficSignalType,0))*Misc!$F20,0),0)","v":0},{"$f":"ROUND(IFERROR(INDEX('Savings Summary'!$P$8:$P$50,MATCH($B$16,'Savings Summary'!$C$8:$C$50,0))*D20+\nINDEX('Savings Summary'!$N$8:$N$50,MATCH($B$16,'Savings Summary'!$C$8:$C$50,0))*B20+\nINDEX('Savings Summary'!$O$8:$O$50,MATCH($B$16,'Savings Summary'!$C$8:$C$50,0))*C20,0),2)","v":0}]
["HIDE",{"$f":"ROUND(IFERROR(INDEX('Lookup tables'!E$767:E$780,MATCH(Misc!$G21,LEDTrafficSignalType,0))*Misc!$F21,0),3)","v":0},0,{"$f":"ROUND(IFERROR(INDEX('Lookup tables'!F$767:F$780,MATCH(Misc!$G21,LEDTrafficSignalType,0))*Misc!$F21,0),0)","v":0},{"$f":"ROUND(IFERROR(INDEX('Savings Summary'!$P$8:$P$50,MATCH($B$16,'Savings Summary'!$C$8:$C$50,0))*D21+\nINDEX('Savings Summary'!$N$8:$N$50,MATCH($B$16,'Savings Summary'!$C$8:$C$50,0))*B21+\nINDEX('Savings Summary'!$O$8:$O$50,MATCH($B$16,'Savings Summary'!$C$8:$C$50,0))*C21,0),2)","v":0}]
["HIDE",{"$f":"ROUND(IFERROR(INDEX('Lookup tables'!E$767:E$780,MATCH(Misc!$G22,LEDTrafficSignalType,0))*Misc!$F22,0),3)","v":0},0,{"$f":"ROUND(IFERROR(INDEX('Lookup tables'!F$767:F$780,MATCH(Misc!$G22,LEDTrafficSignalType,0))*Misc!$F22,0),0)","v":0},{"$f":"ROUND(IFERROR(INDEX('Savings Summary'!$P$8:$P$50,MATCH($B$16,'Savings Summary'!$C$8:$C$50,0))*D22+\nINDEX('Savings Summary'!$N$8:$N$50,MATCH($B$16,'Savings Summary'!$C$8:$C$50,0))*B22+\nINDEX('Savings Summary'!$O$8:$O$50,MATCH($B$16,'Savings Summary'!$C$8:$C$50,0))*C22,0),2)","v":0}]
["HIDE",{"$f":"ROUND(IFERROR(INDEX('Lookup tables'!E$767:E$780,MATCH(Misc!$G23,LEDTrafficSignalType,0))*Misc!$F23,0),3)","v":0},0,{"$f":"ROUND(IFERROR(INDEX('Lookup tables'!F$767:F$780,MATCH(Misc!$G23,LEDTrafficSignalType,0))*Misc!$F23,0),0)","v":0},{"$f":"ROUND(IFERROR(INDEX('Savings Summary'!$P$8:$P$50,MATCH($B$16,'Savings Summary'!$C$8:$C$50,0))*D23+\nINDEX('Savings Summary'!$N$8:$N$50,MATCH($B$16,'Savings Summary'!$C$8:$C$50,0))*B23+\nINDEX('Savings Summary'!$O$8:$O$50,MATCH($B$16,'Savings Summary'!$C$8:$C$50,0))*C23,0),2)","v":0}]
["HIDE",{"$f":"ROUND(IFERROR(INDEX('Lookup tables'!E$767:E$780,MATCH(Misc!$G24,LEDTrafficSignalType,0))*Misc!$F24,0),3)","v":0},0,{"$f":"ROUND(IFERROR(INDEX('Lookup tables'!F$767:F$780,MATCH(Misc!$G24,LEDTrafficSignalType,0))*Misc!$F24,0),0)","v":0},{"$f":"ROUND(IFERROR(INDEX('Savings Summary'!$P$8:$P$50,MATCH($B$16,'Savings Summary'!$C$8:$C$50,0))*D24+\nINDEX('Savings Summary'!$N$8:$N$50,MATCH($B$16,'Savings Summary'!$C$8:$C$50,0))*B24+\nINDEX('Savings Summary'!$O$8:$O$50,MATCH($B$16,'Savings Summary'!$C$8:$C$50,0))*C24,0),2)","v":0}]
["HIDE",{"$f":"ROUND(IFERROR(INDEX('Lookup tables'!E$767:E$780,MATCH(Misc!$G25,LEDTrafficSignalType,0))*Misc!$F25,0),3)","v":0},0,{"$f":"ROUND(IFERROR(INDEX('Lookup tables'!F$767:F$780,MATCH(Misc!$G25,LEDTrafficSignalType,0))*Misc!$F25,0),0)","v":0},{"$f":"ROUND(IFERROR(INDEX('Savings Summary'!$P$8:$P$50,MATCH($B$16,'Savings Summary'!$C$8:$C$50,0))*D25+\nINDEX('Savings Summary'!$N$8:$N$50,MATCH($B$16,'Savings Summary'!$C$8:$C$50,0))*B25+\nINDEX('Savings Summary'!$O$8:$O$50,MATCH($B$16,'Savings Summary'!$C$8:$C$50,0))*C25,0),2)","v":0}]
["HIDE",{"$f":"SUM(B18:B25)","v":0},{"$f":"SUM(C18:C25)","v":0},{"$f":"SUM(D18:D25)","v":0},{"$f":"SUM(E18:E25)","v":0}]
[null,"Steam Trap Repair or Replacement"]
["HIDE","Peak kW","NC kW","kWh","Uncapped Incentive","System Audit?","Quantity of Steam Traps Repaired/Replaced","Steam System Description",null,"Building Type"]
["HIDE",{"$f":"ROUND(IFERROR(INDEX('Lookup tables'!$E$829:$N$863,MATCH(IF(Misc!H29=\"Commercial heating Low-Pressure Steam\",J29,H29),'Lookup tables'!D829:D863,0),MATCH(State&SelectedZone,'Lookup tables'!$E$828:$I$828,0)+IF(Misc!F29=\"Yes\",5,0))*Misc!G29,0),3)","v":0},{"$f":"B29","v":0},{"$f":"ROUND(IFERROR(INDEX('Lookup tables'!$F$813:$G$825,IF(Misc!H29=\"Commercial heating Low-Pressure Steam\",MATCH(State&SelectedZone,'Lookup tables'!$E$813:$E$825,0),MATCH(Misc!H29,'Lookup tables'!$D$813:$D$820,0)),IF(Misc!F29=\"No\",1,2))*Misc!G29,0),0)","v":0},{"$f":"ROUND(IFERROR(INDEX('Savings Summary'!$P$8:$P$50,MATCH($B$27,'Savings Summary'!$C$8:$C$50,0))*D29+\nINDEX('Savings Summary'!$N$8:$N$50,MATCH($B$27,'Savings Summary'!$C$8:$C$50,0))*B29+\nINDEX('Savings Summary'!$O$8:$O$50,MATCH($B$27,'Savings Summary'!$C$8:$C$50,0))*C29,0),2)","v":0}]
["HIDE",{"$f":"ROUND(IFERROR(INDEX('Lookup tables'!$E$829:$N$863,MATCH(IF(Misc!H30=\"Commercial heating Low-Pressure Steam\",J30,H30),'Lookup tables'!D830:D864,0),MATCH(State&SelectedZone,'Lookup tables'!$E$828:$I$828,0)+IF(Misc!F30=\"Yes\",5,0))*Misc!G30,0),3)","v":0},{"$f":"B30","v":0},{"$f":"ROUND(IFERROR(INDEX('Lookup tables'!$F$813:$G$825,IF(Misc!H30=\"Commercial heating Low-Pressure Steam\",MATCH(State&SelectedZone,'Lookup tables'!$E$813:$E$825,0),MATCH(Misc!H30,'Lookup tables'!$D$813:$D$820,0)),IF(Misc!F30=\"No\",1,2))*Misc!G30,0),0)","v":0},{"$f":"ROUND(IFERROR(INDEX('Savings Summary'!$P$8:$P$50,MATCH($B$27,'Savings Summary'!$C$8:$C$50,0))*D30+\nINDEX('Savings Summary'!$N$8:$N$50,MATCH($B$27,'Savings Summary'!$C$8:$C$50,0))*B30+\nINDEX('Savings Summary'!$O$8:$O$50,MATCH($B$27,'Savings Summary'!$C$8:$C$50,0))*C30,0),2)","v":0}]
["HIDE",{"$f":"ROUND(IFERROR(INDEX('Lookup tables'!$E$829:$N$863,MATCH(IF(Misc!H31=\"Commercial heating Low-Pressure Steam\",J31,H31),'Lookup tables'!D831:D865,0),MATCH(State&SelectedZone,'Lookup tables'!$E$828:$I$828,0)+IF(Misc!F31=\"Yes\",5,0))*Misc!G31,0),3)","v":0},0,{"$f":"ROUND(IFERROR(INDEX('Lookup tables'!$F$813:$G$825,IF(Misc!H31=\"Commercial heating Low-Pressure Steam\",MATCH(State&SelectedZone,'Lookup tables'!$E$813:$E$825,0),MATCH(Misc!H31,'Lookup tables'!$D$813:$D$820,0)),IF(Misc!F31=\"No\",1,2))*Misc!G31,0),0)","v":0},{"$f":"ROUND(IFERROR(INDEX('Savings Summary'!$P$8:$P$50,MATCH($B$27,'Savings Summary'!$C$8:$C$50,0))*D31+\nINDEX('Savings Summary'!$N$8:$N$50,MATCH($B$27,'Savings Summary'!$C$8:$C$50,0))*B31+\nINDEX('Savings Summary'!$O$8:$O$50,MATCH($B$27,'Savings Summary'!$C$8:$C$50,0))*C31,0),2)","v":0}]
["HIDE",{"$f":"SUM(B29:B31)","v":0},{"$f":"SUM(C29:C31)","v":0},{"$f":"SUM(D29:D31)","v":0},{"$f":"SUM(E29:E31)","v":0},"Eligibility Criteria:","·Commercial & Industrial applications only\n·System pressure less than 300 psig"]
[null,"Hand Dryers"]
["HIDE","Peak kW","NC kW","kWh","Uncapped Incentive","Quantity (#)","Model","Building Type"]
["HIDE",{"$f":"ROUND(IFERROR(INDEX('Lookup tables'!$F$867:$K$880,MATCH(Misc!H35,HandDryerBldgType,0),MATCH(State&SelectedZone,'Lookup tables'!$F$866:$K$866,0))*Misc!F35,0),3)","v":0},{"$f":"B35","v":0},{"$f":"ROUND(IFERROR(INDEX('Lookup tables'!$E$867:$E$880,MATCH(Misc!H35,HandDryerBldgType,0))*Misc!F35,0),0)","v":0},{"$f":"ROUND(IFERROR(INDEX('Savings Summary'!$P$8:$P$51,MATCH($B$33,'Savings Summary'!$C$8:$C$51,0))*D35+\nINDEX('Savings Summary'!$N$8:$N$51,MATCH($B$33,'Savings Summary'!$C$8:$C$51,0))*B35+\nINDEX('Savings Summary'!$O$8:$O$51,MATCH($B$33,'Savings Summary'!$C$8:$C$51,0))*C35,0),2)","v":0}]
["HIDE",{"$f":"ROUND(IFERROR(INDEX('Lookup tables'!$F$867:$K$880,MATCH(Misc!H36,HandDryerBldgType,0),MATCH(State&SelectedZone,'Lookup tables'!$F$866:$K$866,0))*Misc!F36,0),3)","v":0},{"$f":"B36","v":0},{"$f":"ROUND(IFERROR(INDEX('Lookup tables'!$E$867:$E$880,MATCH(Misc!H36,HandDryerBldgType,0))*Misc!F36,0),0)","v":0},{"$f":"ROUND(IFERROR(INDEX('Savings Summary'!$P$8:$P$51,MATCH($B$33,'Savings Summary'!$C$8:$C$51,0))*D36+\nINDEX('Savings Summary'!$N$8:$N$51,MATCH($B$33,'Savings Summary'!$C$8:$C$51,0))*B36+\nINDEX('Savings Summary'!$O$8:$O$51,MATCH($B$33,'Savings Summary'!$C$8:$C$51,0))*C36,0),2)","v":0}]
["HIDE",{"$f":"ROUND(IFERROR(INDEX('Lookup tables'!$F$867:$K$880,MATCH(Misc!H37,HandDryerBldgType,0),MATCH(State&SelectedZone,'Lookup tables'!$F$866:$K$866,0))*Misc!F37,0),3)","v":0},0,{"$f":"ROUND(IFERROR(INDEX('Lookup tables'!$E$867:$E$880,MATCH(Misc!H37,HandDryerBldgType,0))*Misc!F37,0),0)","v":0},{"$f":"ROUND(IFERROR(INDEX('Savings Summary'!$P$8:$P$51,MATCH($B$33,'Savings Summary'!$C$8:$C$51,0))*D37+\nINDEX('Savings Summary'!$N$8:$N$51,MATCH($B$33,'Savings Summary'!$C$8:$C$51,0))*B37+\nINDEX('Savings Summary'!$O$8:$O$51,MATCH($B$33,'Savings Summary'!$C$8:$C$51,0))*C37,0),2)","v":0}]
["HIDE",{"$f":"SUM(B35:B37)","v":0},{"$f":"SUM(C35:C37)","v":0},{"$f":"SUM(D35:D37)","v":0},{"$f":"SUM(E35:E37)","v":0},"Eligibility Criteria:","·Must be equipped with motion sensors\n·Uses 5Wh or less per use"]

{"sheet":"DSMT Export","index":9,"n_rows":171,"n_cols":79,"rows_kept":171,"cut":false,"hidden":true,"merged":[[2,6,3,6],[13,0,14,5],[21,1,22,5],[11,0,12,5],[0,0,0,3]]}
["Project Export for DSMT\nUse this sheet to export a lighting project to a CSV file, which can be uploaded into DSMT using the Salesforce Data Import Wizard.",null,null,null,{"$f":"IF(C27=\"UAT\",\"(UAT)\",\"\")","v":""},null,null,null,"Measure Name (Green measures will be uploaded to DSMT)","Measure Instance","Eligible_Measure__c","RecordTypeId","Application_Premise__c","Enrollment_Application__c","Summer_Coincident_Peak_Demand_Savings_kW__c","WC_Peak_Demand_Savings_kW__c","Non_Coincident_Peak_Demand_Savings_kW__c","Annual_Electric_Energy_Savings_kwh__c","Total_Incentive_New__c","Quantity__c","Model__c","Application__c","Configuration__c","Type_picklist__c","Climate_Zone__c","Building_Type__c","Project_Type__c","Area_sqft__c","Height_in__c","Width_in__c","Width_ft__c","Length_in_Feet__c","Volume_cubic_feet__c","Number_of_Sides__c","Motor_Rating__c","Controls_Installed__c","Existing_Motor_Type__c","Connected_Load_W__c","Annual_Operating_Hours_hours_year__c","Oven_Size__c","Number_of_Pans_Picklist__c","Volume_Range_ft3__c","GAP_Width_in__c","Product_Class__c","Maximum_Flow_Rate_GPM__c","Efficient_Average_Flow_Rate_GPM__c","Efficient_Ice_Machine_Type__c","Efficient_Ice_Production_Type__c","Ice_Machine_Harvest_Rate_lbs_day__c","Efficient_Energy_Use_kWh_100_lbs_ice__c","Baseline_R_Value_Picklist__c","Efficient_R_Value_Picklist__c","System_Type__c","Existing_Heating_System_Type__c","Heating_and_Cooling_System_Type__c","Intial_Solar_Reflectance__c","Factor_1__c","Factor_2__c","Factor_Text_1__c","Factor_Text_2__c","Efficient_Motor_Horsepower_hp__c","Efficient_Motor_Horsepower_hp_number__c","Efficient_Horsepower_hp__c","Efficient_Motor_Efficiency__c","Efficient_Motor_Load_Factor__c","Existing_Control_Strategy__c","Fan_CFM__c","Existing_Cooling_Capacity_tons__c","Existing_Cooling_Capacity_BTUH__c","Existing_Full_Load_Efficiency_kW_ton__c","Existing_Design_Efficiency_kW_ton__c","Existing_Energy_Efficiency_Ratio__c","Existing_Seasonal_Energy_Ratio__c","Existing_IEER__c","Existing_Heat_Seasonal_Prfrmnce_Factor__c","Existing_COP__c","Number_of_Rooms__c","Temperature_Setback__c","ENERGY_STAR_Certified__c"]
["Import Instructions",null,null,null,null,null,null,null,"Door Gaskets",1,{"$f":"INDEX('Savings Summary'!$Q$8:$Q$51,MATCH('DSMT Export'!I2,'Savings Summary'!$C$8:$C$51,0))","v":"a1r3u000003Fil7AAC"},{"$f":"INDEX('Savings Summary'!$R$8:$R$51,MATCH('DSMT Export'!I2,'Savings Summary'!$C$8:$C$51,0))","v":"0123u000000VQdAAAW"},{"$f":"APID","v":0},{"$f":"EAID","v":0},{"$f":"ROUND(Refrigeration!B5,3)","v":0},{"$f":"0","v":0},{"$f":"ROUND(MAX(Refrigeration!C5,O2:P2),3)","v":0},{"$f":"ROUND(Refrigeration!D5,0)","v":0},{"$f":"Refrigeration!E5","v":0},{"$f":"Refrigeration!F5","v":0},null,{"$f":"Refrigeration!J5","v":0},null,null,{"$f":"SelectedZone","v":4},null,null,null,{"$f":"Refrigeration!G5","v":0},{"$f":"Refrigeration!H5","v":0},null,null,null,{"$f":"Refrigeration!I5","v":0}]
["Enter the Enrollment Application ID and Application Premise ID below, then use the buttons to create and export the CSV.",null,null,null,null,null,null,null,"Door Gaskets",2,{"$f":"INDEX('Savings Summary'!$Q$8:$Q$51,MATCH('DSMT Export'!I3,'Savings Summary'!$C$8:$C$51,0))","v":"a1r3u000003Fil7AAC"},{"$f":"INDEX('Savings Summary'!$R$8:$R$51,MATCH('DSMT Export'!I3,'Savings Summary'!$C$8:$C$51,0))","v":"0123u000000VQdAAAW"},0,0,{"$f":"ROUND(Refrigeration!B6,3)","v":0},{"$f":"0","v":0},{"$f":"ROUND(MAX(Refrigeration!C6,O3:P3),3)","v":0},{"$f":"ROUND(Refrigeration!D6,0)","v":0},{"$f":"Refrigeration!E6","v":0},{"$f":"Refrigeration!F6","v":0},null,{"$f":"Refrigeration!J6","v":0},null,null,4,null,null,null,{"$f":"Refrigeration!G6","v":0},{"$f":"Refrigeration!H6","v":0},null,null,null,{"$f":"Refrigeration!I6","v":0}]
[null,null,null,null,null,null,null,null,"Door Gaskets",3,{"$f":"INDEX('Savings Summary'!$Q$8:$Q$51,MATCH('DSMT Export'!I4,'Savings Summary'!$C$8:$C$51,0))","v":"a1r3u000003Fil7AAC"},{"$f":"INDEX('Savings Summary'!$R$8:$R$51,MATCH('DSMT Export'!I4,'Savings Summary'!$C$8:$C$51,0))","v":"0123u000000VQdAAAW"},0,0,{"$f":"ROUND(Refrigeration!B7,3)","v":0},{"$f":"0","v":0},{"$f":"ROUND(MAX(Refrigeration!C7,O4:P4),3)","v":0},{"$f":"ROUND(Refrigeration!D7,0)","v":0},{"$f":"Refrigeration!E7","v":0},{"$f":"Refrigeration!F7","v":0},null,{"$f":"Refrigeration!J7","v":0},null,null,4,null,null,null,{"$f":"Refrigeration!G7","v":0},{"$f":"Refrigeration!H7","v":0},null,null,null,{"$f":"Refrigeration!I7","v":0}]
[null,"Enrollment Application ID:",null,null,null,null,null,null,"Door Gaskets",4,{"$f":"INDEX('Savings Summary'!$Q$8:$Q$51,MATCH('DSMT Export'!I5,'Savings Summary'!$C$8:$C$51,0))","v":"a1r3u000003Fil7AAC"},{"$f":"INDEX('Savings Summary'!$R$8:$R$51,MATCH('DSMT Export'!I5,'Savings Summary'!$C$8:$C$51,0))","v":"0123u000000VQdAAAW"},0,0,{"$f":"ROUND(Refrigeration!B8,3)","v":0},{"$f":"0","v":0},{"$f":"ROUND(MAX(Refrigeration!C8,O5:P5),3)","v":0},{"$f":"ROUND(Refrigeration!D8,0)","v":0},{"$f":"Refrigeration!E8","v":0},{"$f":"Refrigeration!F8","v":0},null,{"$f":"Refrigeration!J8","v":0},null,null,4,null,null,null,{"$f":"Refrigeration!G8","v":0},{"$f":"Refrigeration!H8","v":0},null,null,null,{"$f":"Refrigeration!I8","v":0}]
[null,"Application Premise ID:",null,null,null,null,null,null,"Door Gaskets",5,{"$f":"INDEX('Savings Summary'!$Q$8:$Q$51,MATCH('DSMT Export'!I6,'Savings Summary'!$C$8:$C$51,0))","v":"a1r3u000003Fil7AAC"},{"$f":"INDEX('Savings Summary'!$R$8:$R$51,MATCH('DSMT Export'!I6,'Savings Summary'!$C$8:$C$51,0))","v":"0123u000000VQdAAAW"},0,0,{"$f":"ROUND(Refrigeration!B9,3)","v":0},{"$f":"0","v":0},{"$f":"ROUND(MAX(Refrigeration!C9,O6:P6),3)","v":0},{"$f":"ROUND(Refrigeration!D9,0)","v":0},{"$f":"Refrigeration!E9","v":0},{"$f":"Refrigeration!F9","v":0},null,{"$f":"Refrigeration!J9","v":0},null,null,4,null,null,null,{"$f":"Refrigeration!G9","v":0},{"$f":"Refrigeration!H9","v":0},null,null,null,{"$f":"Refrigeration!I9","v":0}]
[null,null,null,null,null,null,null,null,"Door Heater Controls for Refrigerated Display Cases ",1,{"$f":"INDEX('Savings Summary'!$Q$8:$Q$51,MATCH('DSMT Export'!I7,'Savings Summary'!$C$8:$C$51,0))","v":"a1r3u000003Fil9AAC"},{"$f":"INDEX('Savings Summary'!$R$8:$R$51,MATCH('DSMT Export'!I7,'Savings Summary'!$C$8:$C$51,0))","v":"0123u000000VQdAAAW"},0,0,{"$f":"ROUND(Refrigeration!B13,3)","v":0},{"$f":"0","v":0},{"$f":"ROUND(MAX(O7:P7,Refrigeration!C13),3)","v":0},{"$f":"ROUND(Refrigeration!D13,0)","v":0},{"$f":"Refrigeration!E13","v":0},null,null,{"$f":"Refrigeration!G13","v":0},null,null,4,null,null,null,null,null,{"$f":"Refrigeration!F13","v":0}]
[null,null,null,null,null,null,null,null,"Door Heater Controls for Refrigerated Display Cases ",2,{"$f":"INDEX('Savings Summary'!$Q$8:$Q$51,MATCH('DSMT Export'!I8,'Savings Summary'!$C$8:$C$51,0))","v":"a1r3u000003Fil9AAC"},{"$f":"INDEX('Savings Summary'!$R$8:$R$51,MATCH('DSMT Export'!I8,'Savings Summary'!$C$8:$C$51,0))","v":"0123u000000VQdAAAW"},0,0,{"$f":"ROUND(Refrigeration!B14,3)","v":0},{"$f":"0","v":0},{"$f":"ROUND(MAX(O8:P8,Refrigeration!C14),3)","v":0},{"$f":"ROUND(Refrigeration!D14,0)","v":0},{"$f":"Refrigeration!E14","v":0},null,null,{"$f":"Refrigeration!G14","v":0},null,null,4,null,null,null,null,null,{"$f":"Refrigeration!F14","v":0}]
[null,null,null,null,null,null,null,null,"Door Heater Controls for Refrigerated Display Cases ",3,{"$f":"INDEX('Savings Summary'!$Q$8:$Q$51,MATCH('DSMT Export'!I9,'Savings Summary'!$C$8:$C$51,0))","v":"a1r3u000003Fil9AAC"},{"$f":"INDEX('Savings Summary'!$R$8:$R$51,MATCH('DSMT Export'!I9,'Savings Summary'!$C$8:$C$51,0))","v":"0123u000000VQdAAAW"},0,0,{"$f":"ROUND(Refrigeration!B15,3)","v":0},{"$f":"0","v":0},{"$f":"ROUND(MAX(O9:P9,Refrigeration!C15),3)","v":0},{"$f":"ROUND(Refrigeration!D15,0)","v":0},{"$f":"Refrigeration!E15","v":0},null,null,{"$f":"Refrigeration!G15","v":0},null,null,4,null,null,null,null,null,{"$f":"Refrigeration!F15","v":0}]
[null,null,null,null,null,null,null,null,"ECM Evaporator Fan Motors for Refrigerated Display Cases",1,{"$f":"INDEX('Savings Summary'!$Q$8:$Q$51,MATCH('DSMT Export'!I10,'Savings Summary'!$C$8:$C$51,0))","v":"a1r3u000003FilBAAS"},{"$f":"INDEX('Savings Summary'!$R$8:$R$51,MATCH('DSMT Export'!I10,'Savings Summary'!$C$8:$C$51,0))","v":"0123u000000VQdGAAW"},0,0,{"$f":"ROUND(Refrigeration!B19,3)","v":0},{"$f":"0","v":0},{"$f":"ROUND(MAX(O10:P10,Refrigeration!C19),3)","v":0},{"$f":"ROUND(Refrigeration!D19,0)","v":0},{"$f":"Refrigeration!E19","v":0},{"$f":"Refrigeration!F19","v":0},null,{"$f":"Refrigeration!G19","v":0},null,null,4,null,null,null,null,null,null,null,null,null,{"$f":"Refrigeration!H19","v":0},{"$f":"Refrigeration!I19","v":0},{"$f":"Refrigeration!J19","v":0}]
[null,null,null,null,null,null,null,null,"ECM Evaporator Fan Motors for Refrigerated Display Cases",2,{"$f":"INDEX('Savings Summary'!$Q$8:$Q$51,MATCH('DSMT Export'!I11,'Savings Summary'!$C$8:$C$51,0))","v":"a1r3u000003FilBAAS"},{"$f":"INDEX('Savings Summary'!$R$8:$R$51,MATCH('DSMT Export'!I11,'Savings Summary'!$C$8:$C$51,0))","v":"0123u000000VQdGAAW"},0,0,{"$f":"ROUND(Refrigeration!B20,3)","v":0},{"$f":"0","v":0},{"$f":"ROUND(MAX(O11:P11,Refrigeration!C20),3)","v":0},{"$f":"ROUND(Refrigeration!D20,0)","v":0},{"$f":"Refrigeration!E20","v":0},{"$f":"Refrigeration!F20","v":0},null,{"$f":"Refrigeration!G20","v":0},null,null,4,null,null,null,null,null,null,null,null,null,{"$f":"Refrigeration!H20","v":0},{"$f":"Refrigeration!I20","v":0},{"$f":"Refrigeration!J20","v":0}]
["The enrollment application record ID can be found by navigating to the Enrollment Application in DSMT in your web browser and copying the ID at the end of the web address (after .com/).",null,null,null,null,null,null,null,"ECM Evaporator Fan Motors for Refrigerated Display Cases",3,{"$f":"INDEX('Savings Summary'!$Q$8:$Q$51,MATCH('DSMT Export'!I12,'Savings Summary'!$C$8:$C$51,0))","v":"a1r3u000003FilBAAS"},{"$f":"INDEX('Savings Summary'!$R$8:$R$51,MATCH('DSMT Export'!I12,'Savings Summary'!$C$8:$C$51,0))","v":"0123u000000VQdGAAW"},0,0,{"$f":"ROUND(Refrigeration!B21,3)","v":0},{"$f":"0","v":0},{"$f":"ROUND(MAX(O12:P12,Refrigeration!C21),3)","v":0},{"$f":"ROUND(Refrigeration!D21,0)","v":0},{"$f":"Refrigeration!E21","v":0},{"$f":"Refrigeration!F21","v":0},null,{"$f":"Refrigeration!G21","v":0},null,null,4,null,null,null,null,null,null,null,null,null,{"$f":"Refrigeration!H21","v":0},{"$f":"Refrigeration!I21","v":0},{"$f":"Refrigeration!J21","v":0}]
[null,null,null,null,null,null,null,null,"ECM Evaporator Fan Motors for Refrigerated Display Cases",4,{"$f":"INDEX('Savings Summary'!$Q$8:$Q$51,MATCH('DSMT Export'!I13,'Savings Summary'!$C$8:$C$51,0))","v":"a1r3u000003FilBAAS"},{"$f":"INDEX('Savings Summary'!$R$8:$R$51,MATCH('DSMT Export'!I13,'Savings Summary'!$C$8:$C$51,0))","v":"0123u000000VQdGAAW"},0,0,{"$f":"ROUND(Refrigeration!B22,3)","v":0},{"$f":"0","v":0},{"$f":"ROUND(MAX(O13:P13,Refrigeration!C22),3)","v":0},{"$f":"ROUND(Refrigeration!D22,0)","v":0},{"$f":"Refrigeration!E22","v":0},{"$f":"Refrigeration!F22","v":0},null,{"$f":"Refrigeration!G22","v":0},null,null,4,null,null,null,null,null,null,null,null,null,{"$f":"Refrigeration!H22","v":0},{"$f":"Refrigeration!I22","v":0},{"$f":"Refrigeration!J22","v":0}]
["The application premise record ID can be found by navigating to the Application Premise in DSMT in your web browser and copying the ID at the end of the web address (after .com/).",null,null,null,null,null,null,null,"ECM Evaporator Fan Motors for Refrigerated Display Cases",5,{"$f":"INDEX('Savings Summary'!$Q$8:$Q$51,MATCH('DSMT Export'!I14,'Savings Summary'!$C$8:$C$51,0))","v":"a1r3u000003FilBAAS"},{"$f":"INDEX('Savings Summary'!$R$8:$R$51,MATCH('DSMT Export'!I14,'Savings Summary'!$C$8:$C$51,0))","v":"0123u000000VQdGAAW"},0,0,{"$f":"ROUND(Refrigeration!B23,3)","v":0},{"$f":"0","v":0},{"$f":"ROUND(MAX(O14:P14,Refrigeration!C23),3)","v":0},{"$f":"ROUND(Refrigeration!D23,0)","v":0},{"$f":"Refrigeration!E23","v":0},{"$f":"Refrigeration!F23","v":0},null,{"$f":"Refrigeration!G23","v":0},null,null,4,null,null,null,null,null,null,null,null,null,{"$f":"Refrigeration!H23","v":0},{"$f":"Refrigeration!I23","v":0},{"$f":"Refrigeration!J23","v":0}]
[null,null,null,null,null,null,null,null,"ECM Evaporator Fan Motors for Refrigerated Display Cases",6,{"$f":"INDEX('Savings Summary'!$Q$8:$Q$51,MATCH('DSMT Export'!I15,'Savings Summary'!$C$8:$C$51,0))","v":"a1r3u000003FilBAAS"},{"$f":"INDEX('Savings Summary'!$R$8:$R$51,MATCH('DSMT Export'!I15,'Savings Summary'!$C$8:$C$51,0))","v":"0123u000000VQdGAAW"},0,0,{"$f":"ROUND(Refrigeration!B24,3)","v":0},{"$f":"0","v":0},{"$f":"ROUND(MAX(O15:P15,Refrigeration!C24),3)","v":0},{"$f":"ROUND(Refrigeration!D24,0)","v":0},{"$f":"Refrigeration!E24","v":0},{"$f":"Refrigeration!F24","v":0},null,{"$f":"Refrigeration!G24","v":0},null,null,4,null,null,null,null,null,null,null,null,null,{"$f":"Refrigeration!H24","v":0},{"$f":"Refrigeration!I24","v":0},{"$f":"Refrigeration!J24","v":0}]
[null,null,null,null,null,null,null,null,"ECM Evaporator Fan Motors for Refrigerated Display Cases",7,{"$f":"INDEX('Savings Summary'!$Q$8:$Q$51,MATCH('DSMT Export'!I16,'Savings Summary'!$C$8:$C$51,0))","v":"a1r3u000003FilBAAS"},{"$f":"INDEX('Savings Summary'!$R$8:$R$51,MATCH('DSMT Export'!I16,'Savings Summary'!$C$8:$C$51,0))","v":"0123u000000VQdGAAW"},0,0,{"$f":"ROUND(Refrigeration!B25,3)","v":0},{"$f":"0","v":0},{"$f":"ROUND(MAX(O16:P16,Refrigeration!C25),3)","v":0},{"$f":"ROUND(Refrigeration!D25,0)","v":0},{"$f":"Refrigeration!E25","v":0},{"$f":"Refrigeration!F25","v":0},null,{"$f":"Refrigeration!G25","v":0},null,null,4,null,null,null,null,null,null,null,null,null,{"$f":"Refrigeration!H25","v":0},{"$f":"Refrigeration!I25","v":0},{"$f":"Refrigeration!J25","v":0}]
["Launching the Import Wizard in Salesforce",null,null,null,null,null,null,null,"ECM Evaporator Fan Motors for Refrigerated Display Cases",8,{"$f":"INDEX('Savings Summary'!$Q$8:$Q$51,MATCH('DSMT Export'!I17,'Savings Summary'!$C$8:$C$51,0))","v":"a1r3u000003FilBAAS"},{"$f":"INDEX('Savings Summary'!$R$8:$R$51,MATCH('DSMT Export'!I17,'Savings Summary'!$C$8:$C$51,0))","v":"0123u000000VQdGAAW"},0,0,{"$f":"ROUND(Refrigeration!B26,3)","v":0},{"$f":"0","v":0},{"$f":"ROUND(MAX(O17:P17,Refrigeration!C26),3)","v":0},{"$f":"ROUND(Refrigeration!D26,0)","v":0},{"$f":"Refrigeration!E26","v":0},{"$f":"Refrigeration!F26","v":0},null,{"$f":"Refrigeration!G26","v":0},null,null,4,null,null,null,null,null,null,null,null,null,{"$f":"Refrigeration!H26","v":0},{"$f":"Refrigeration!I26","v":0},{"$f":"Refrigeration!J26","v":0}]
["1.","Login to Salesforce in the environment you will be testing. ",null,null,null,null,null,null,"Electronic Defrost Controls",1,{"$f":"INDEX('Savings Summary'!$Q$8:$Q$51,MATCH('DSMT Export'!I18,'Savings Summary'!$C$8:$C$51,0))","v":"a1r3u000003FilKAAS"},{"$f":"INDEX('Savings Summary'!$R$8:$R$51,MATCH('DSMT Export'!I18,'Savings Summary'!$C$8:$C$51,0))","v":"0123u000000VQdJAAW"},0,0,{"$f":"ROUND(Refrigeration!B30,3)","v":0},{"$f":"0","v":0},{"$f":"ROUND(MAX(O18:P18,Refrigeration!C30),3)","v":0},{"$f":"ROUND(Refrigeration!D30,0)","v":0},{"$f":"Refrigeration!E30","v":0},null,null,{"$f":"Refrigeration!G30","v":0},null,null,4,null,null,null,null,null,null,null,null,null,null,null,null,{"$f":"Refrigeration!F30","v":0},{"$f":"Refrigeration!H30","v":0}]
["2.","Navigate to Upload MLIs by clicking on the \"+\" sign in the top right corner of the page.",null,null,null,null,null,null,"Electronic Defrost Controls",2,{"$f":"INDEX('Savings Summary'!$Q$8:$Q$51,MATCH('DSMT Export'!I19,'Savings Summary'!$C$8:$C$51,0))","v":"a1r3u000003FilKAAS"},{"$f":"INDEX('Savings Summary'!$R$8:$R$51,MATCH('DSMT Export'!I19,'Savings Summary'!$C$8:$C$51,0))","v":"0123u000000VQdJAAW"},0,0,{"$f":"ROUND(Refrigeration!B31,3)","v":0},{"$f":"0","v":0},{"$f":"ROUND(MAX(O19:P19,Refrigeration!C31),3)","v":0},{"$f":"ROUND(Refrigeration!D31,0)","v":0},{"$f":"Refrigeration!E31","v":0},null,null,{"$f":"Refrigeration!G31","v":0},null,null,4,null,null,null,null,null,null,null,null,null,null,null,null,{"$f":"Refrigeration!F31","v":0},{"$f":"Refrigeration!H31","v":0}]
["3.","Click on the \"Choose File\" button and select the CSV file you created.",null,null,null,null,null,null,"Electronic Defrost Controls",3,{"$f":"INDEX('Savings Summary'!$Q$8:$Q$51,MATCH('DSMT Export'!I20,'Savings Summary'!$C$8:$C$51,0))","v":"a1r3u000003FilKAAS"},{"$f":"INDEX('Savings Summary'!$R$8:$R$51,MATCH('DSMT Export'!I20,'Savings Summary'!$C$8:$C$51,0))","v":"0123u000000VQdJAAW"},0,0,{"$f":"ROUND(Refrigeration!B32,3)","v":0},{"$f":"0","v":0},{"$f":"ROUND(MAX(O20:P20,Refrigeration!C32),3)","v":0},{"$f":"ROUND(Refrigeration!D32,0)","v":0},{"$f":"Refrigeration!E32","v":0},null,null,{"$f":"Refrigeration!G32","v":0},null,null,4,null,null,null,null,null,null,null,null,null,null,null,null,{"$f":"Refrigeration!F32","v":0},{"$f":"Refrigeration!H32","v":0}]
["4.","Select the \"Upload File\" button.",null,null,null,null,null,null,"Electronic Defrost Controls",4,{"$f":"INDEX('Savings Summary'!$Q$8:$Q$51,MATCH('DSMT Export'!I21,'Savings Summary'!$C$8:$C$51,0))","v":"a1r3u000003FilKAAS"},{"$f":"INDEX('Savings Summary'!$R$8:$R$51,MATCH('DSMT Export'!I21,'Savings Summary'!$C$8:$C$51,0))","v":"0123u000000VQdJAAW"},0,0,{"$f":"ROUND(Refrigeration!B33,3)","v":0},{"$f":"0","v":0},{"$f":"ROUND(MAX(O21:P21,Refrigeration!C33),3)","v":0},{"$f":"ROUND(Refrigeration!D33,0)","v":0},{"$f":"Refrigeration!E33","v":0},null,null,{"$f":"Refrigeration!G33","v":0},null,null,4,null,null,null,null,null,null,null,null,null,null,null,null,{"$f":"Refrigeration!F33","v":0},{"$f":"Refrigeration!H33","v":0}]
["5.","An email will be sent to your account once all MLIs are imported. Depending on how large the CSV file is, this may take anywhere between 1-3 hours.",null,null,null,null,null,null,"Electronic Defrost Controls",5,{"$f":"INDEX('Savings Summary'!$Q$8:$Q$51,MATCH('DSMT Export'!I22,'Savings Summary'!$C$8:$C$51,0))","v":"a1r3u000003FilKAAS"},{"$f":"INDEX('Savings Summary'!$R$8:$R$51,MATCH('DSMT Export'!I22,'Savings Summary'!$C$8:$C$51,0))","v":"0123u000000VQdJAAW"},0,0,{"$f":"ROUND(Refrigeration!B34,3)","v":0},{"$f":"0","v":0},{"$f":"ROUND(MAX(O22:P22,Refrigeration!C34),3)","v":0},{"$f":"ROUND(Refrigeration!D34,0)","v":0},{"$f":"Refrigeration!E34","v":0},null,null,{"$f":"Refrigeration!G34","v":0},null,null,4,null,null,null,null,null,null,null,null,null,null,null,null,{"$f":"Refrigeration!F34","v":0},{"$f":"Refrigeration!H34","v":0}]
[null,null,null,null,null,null,null,null,"Evaporator Fan Controls ",1,{"$f":"INDEX('Savings Summary'!$Q$8:$Q$51,MATCH('DSMT Export'!I23,'Savings Summary'!$C$8:$C$51,0))","v":"a1r3u000003FilOAAS"},{"$f":"INDEX('Savings Summary'!$R$8:$R$51,MATCH('DSMT Export'!I23,'Savings Summary'!$C$8:$C$51,0))","v":"0123u000000VQdLAAW"},0,0,{"$f":"ROUND(Refrigeration!B38,3)","v":0},{"$f":"0","v":0},{"$f":"ROUND(MAX(O23:P23,Refrigeration!C38),3)","v":0},{"$f":"ROUND(Refrigeration!D38,0)","v":0},{"$f":"Refrigeration!E38","v":0},{"$f":"Refrigeration!F38","v":0},null,{"$f":"Refrigeration!G38","v":0},null,null,4]
["Note: You can import multiple CSV files at once. One email will be sent out for each file.",null,null,null,null,null,null,null,"Evaporator Fan Controls ",2,{"$f":"INDEX('Savings Summary'!$Q$8:$Q$51,MATCH('DSMT Export'!I24,'Savings Summary'!$C$8:$C$51,0))","v":"a1r3u000003FilOAAS"},{"$f":"INDEX('Savings Summary'!$R$8:$R$51,MATCH('DSMT Export'!I24,'Savings Summary'!$C$8:$C$51,0))","v":"0123u000000VQdLAAW"},0,0,{"$f":"ROUND(Refrigeration!B39,3)","v":0},{"$f":"0","v":0},{"$f":"ROUND(MAX(O24:P24,Refrigeration!C39),3)","v":0},{"$f":"ROUND(Refrigeration!D39,0)","v":0},{"$f":"Refrigeration!E39","v":0},{"$f":"Refrigeration!F39","v":0},null,{"$f":"Refrigeration!G39","v":0},null,null,4]
[null,null,null,null,null,null,null,null,"Evaporator Fan Controls ",3,{"$f":"INDEX('Savings Summary'!$Q$8:$Q$51,MATCH('DSMT Export'!I25,'Savings Summary'!$C$8:$C$51,0))","v":"a1r3u000003FilOAAS"},{"$f":"INDEX('Savings Summary'!$R$8:$R$51,MATCH('DSMT Export'!I25,'Savings Summary'!$C$8:$C$51,0))","v":"0123u000000VQdLAAW"},0,0,{"$f":"ROUND(Refrigeration!B40,3)","v":0},{"$f":"0","v":0},{"$f":"ROUND(MAX(O25:P25,Refrigeration!C40),3)","v":0},{"$f":"ROUND(Refrigeration!D40,0)","v":0},{"$f":"Refrigeration!E40","v":0},{"$f":"Refrigeration!F40","v":0},null,{"$f":"Refrigeration!G40","v":0},null,null,4]
["Advanced Controls",null,null,null,null,null,null,null,"Night Covers for Open Vertical and Horizontal Refrigerated Display Cases",1,{"$f":"INDEX('Savings Summary'!$Q$8:$Q$51,MATCH('DSMT Export'!I26,'Savings Summary'!$C$8:$C$51,0))","v":"a1r3u000003FillAAC"},{"$f":"INDEX('Savings Summary'!$R$8:$R$51,MATCH('DSMT Export'!I26,'Savings Summary'!$C$8:$C$51,0))","v":"0123u000000VQdRAAW"},0,0,{"$f":"ROUND(Refrigeration!B44,3)","v":0},{"$f":"0","v":0},{"$f":"ROUND(MAX(Refrigeration!C44,O26:P26),3)","v":0},{"$f":"ROUND(Refrigeration!D44,0)","v":0},{"$f":"Refrigeration!E44","v":0},null,null,{"$f":"Refrigeration!G44","v":0},{"$f":"Refrigeration!I44","v":0},{"$f":"Refrigeration!H44","v":0},4,null,null,null,null,null,null,{"$f":"Refrigeration!F44","v":0}]
[null,"DSMT Environment:","PROD",null,null,null,null,null,"Night Covers for Open Vertical and Horizontal Refrigerated Display Cases",2,{"$f":"INDEX('Savings Summary'!$Q$8:$Q$51,MATCH('DSMT Export'!I27,'Savings Summary'!$C$8:$C$51,0))","v":"a1r3u000003FillAAC"},{"$f":"INDEX('Savings Summary'!$R$8:$R$51,MATCH('DSMT Export'!I27,'Savings Summary'!$C$8:$C$51,0))","v":"0123u000000VQdRAAW"},0,0,{"$f":"ROUND(Refrigeration!B45,3)","v":0},{"$f":"0","v":0},{"$f":"ROUND(MAX(Refrigeration!C45,O27:P27),3)","v":0},{"$f":"ROUND(Refrigeration!D45,0)","v":0},{"$f":"Refrigeration!E45","v":0},null,null,{"$f":"Refrigeration!G45","v":0},{"$f":"Refrigeration!I45","v":0},{"$f":"Refrigeration!H45","v":0},4,null,null,null,null,null,null,{"$f":"Refrigeration!F45","v":0}]
[null,null,null,null,null,null,null,null,"Night Covers for Open Vertical and Horizontal Refrigerated Display Cases",3,{"$f":"INDEX('Savings Summary'!$Q$8:$Q$51,MATCH('DSMT Export'!I28,'Savings Summary'!$C$8:$C$51,0))","v":"a1r3u000003FillAAC"},{"$f":"INDEX('Savings Summary'!$R$8:$R$51,MATCH('DSMT Export'!I28,'Savings Summary'!$C$8:$C$51,0))","v":"0123u000000VQdRAAW"},0,0,{"$f":"ROUND(Refrigeration!B46,3)","v":0},{"$f":"0","v":0},{"$f":"ROUND(MAX(Refrigeration!C46,O28:P28),3)","v":0},{"$f":"ROUND(Refrigeration!D46,0)","v":0},{"$f":"Refrigeration!E46","v":0},null,null,{"$f":"Refrigeration!G46","v":0},{"$f":"Refrigeration!I46","v":0},{"$f":"Refrigeration!H46","v":0},4,null,null,null,null,null,null,{"$f":"Refrigeration!F46","v":0}]
[null,null,null,null,null,null,null,null,"Night Covers for Open Vertical and Horizontal Refrigerated Display Cases",4,{"$f":"INDEX('Savings Summary'!$Q$8:$Q$51,MATCH('DSMT Export'!I29,'Savings Summary'!$C$8:$C$51,0))","v":"a1r3u000003FillAAC"},{"$f":"INDEX('Savings Summary'!$R$8:$R$51,MATCH('DSMT Export'!I29,'Savings Summary'!$C$8:$C$51,0))","v":"0123u000000VQdRAAW"},0,0,{"$f":"ROUND(Refrigeration!B47,3)","v":0},{"$f":"0","v":0},{"$f":"ROUND(MAX(Refrigeration!C47,O29:P29),3)","v":0},{"$f":"ROUND(Refrigeration!D47,0)","v":0},{"$f":"Refrigeration!E47","v":0},null,null,{"$f":"Refrigeration!G47","v":0},{"$f":"Refrigeration!I47","v":0},{"$f":"Refrigeration!H47","v":0},4,null,null,null,null,null,null,{"$f":"Refrigeration!F47","v":0}]
[null,null,null,null,null,null,null,null,"Night Covers for Open Vertical and Horizontal Refrigerated Display Cases",5,{"$f":"INDEX('Savings Summary'!$Q$8:$Q$51,MATCH('DSMT Export'!I30,'Savings Summary'!$C$8:$C$51,0))","v":"a1r3u000003FillAAC"},{"$f":"INDEX('Savings Summary'!$R$8:$R$51,MATCH('DSMT Export'!I30,'Savings Summary'!$C$8:$C$51,0))","v":"0123u000000VQdRAAW"},0,0,{"$f":"ROUND(Refrigeration!B48,3)","v":0},{"$f":"0","v":0},{"$f":"ROUND(MAX(Refrigeration!C48,O30:P30),3)","v":0},{"$f":"ROUND(Refrigeration!D48,0)","v":0},{"$f":"Refrigeration!E48","v":0},null,null,{"$f":"Refrigeration!G48","v":0},{"$f":"Refrigeration!I48","v":0},{"$f":"Refrigeration!H48","v":0},4,null,null,null,null,null,null,{"$f":"Refrigeration!F48","v":0}]
[null,null,null,null,null,null,null,null,"ENERGY STAR Commercial Refrigerators",1,{"$f":"INDEX('Savings Summary'!$Q$8:$Q$51,MATCH('DSMT Export'!I31,'Savings Summary'!$C$8:$C$51,0))","v":"a1r3u000003Fim5AAC"},{"$f":"INDEX('Savings Summary'!$R$8:$R$51,MATCH('DSMT Export'!I31,'Savings Summary'!$C$8:$C$51,0))","v":"0123u000000VQd6AAG"},0,0,{"$f":"ROUND(Refrigeration!B52,3)","v":0},{"$f":"0","v":0},{"$f":"ROUND(MAX(Refrigeration!C52,O31:P31),3)","v":0},{"$f":"ROUND(Refrigeration!D52,0)","v":0},{"$f":"Refrigeration!E52","v":0},{"$f":"Refrigeration!F52","v":0},{"$f":"Refrigeration!G52","v":0},{"$f":"Refrigeration!I52","v":0},null,{"$f":"Refrigeration!J52","v":0},4,null,null,null,null,null,null,null,{"$f":"Refrigeration!H52","v":0}]
[null,null,null,null,null,null," ",null,"ENERGY STAR Commercial Refrigerators",2,{"$f":"INDEX('Savings Summary'!$Q$8:$Q$51,MATCH('DSMT Export'!I32,'Savings Summary'!$C$8:$C$51,0))","v":"a1r3u000003Fim5AAC"},{"$f":"INDEX('Savings Summary'!$R$8:$R$51,MATCH('DSMT Export'!I32,'Savings Summary'!$C$8:$C$51,0))","v":"0123u000000VQd6AAG"},0,0,{"$f":"ROUND(Refrigeration!B53,3)","v":0},{"$f":"0","v":0},{"$f":"ROUND(MAX(Refrigeration!C53,O32:P32),3)","v":0},{"$f":"ROUND(Refrigeration!D53,0)","v":0},{"$f":"Refrigeration!E53","v":0},{"$f":"Refrigeration!F53","v":0},{"$f":"Refrigeration!G53","v":0},{"$f":"Refrigeration!I53","v":0},null,{"$f":"Refrigeration!J53","v":0},4,null,null,null,null,null,null,null,{"$f":"Refrigeration!H53","v":0}]
[null,null,null,null,null,null," ",null,"ENERGY STAR Commercial Refrigerators",3,{"$f":"INDEX('Savings Summary'!$Q$8:$Q$51,MATCH('DSMT Export'!I33,'Savings Summary'!$C$8:$C$51,0))","v":"a1r3u000003Fim5AAC"},{"$f":"INDEX('Savings Summary'!$R$8:$R$51,MATCH('DSMT Export'!I33,'Savings Summary'!$C$8:$C$51,0))","v":"0123u000000VQd6AAG"},0,0,{"$f":"ROUND(Refrigeration!B54,3)","v":0},{"$f":"0","v":0},{"$f":"ROUND(MAX(Refrigeration!C54,O33:P33),3)","v":0},{"$f":"ROUND(Refrigeration!D54,0)","v":0},{"$f":"Refrigeration!E54","v":0},{"$f":"Refrigeration!F54","v":0},{"$f":"Refrigeration!G54","v":0},{"$f":"Refrigeration!I54","v":0},null,{"$f":"Refrigeration!J54","v":0},4,null,null,null,null,null,null,null,{"$f":"Refrigeration!H54","v":0}]
[null,null,null,null,null,null," ",null,"ENERGY STAR Commercial Refrigerators",4,{"$f":"INDEX('Savings Summary'!$Q$8:$Q$51,MATCH('DSMT Export'!I34,'Savings Summary'!$C$8:$C$51,0))","v":"a1r3u000003Fim5AAC"},{"$f":"INDEX('Savings Summary'!$R$8:$R$51,MATCH('DSMT Export'!I34,'Savings Summary'!$C$8:$C$51,0))","v":"0123u000000VQd6AAG"},{"$f":"APID","v":0},{"$f":"EAID","v":0},{"$f":"ROUND(Refrigeration!B55,3)","v":0},{"$f":"0","v":0},{"$f":"ROUND(MAX(Refrigeration!C55,O34:P34),3)","v":0},{"$f":"ROUND(Refrigeration!D55,0)","v":0},{"$f":"Refrigeration!E55","v":0},{"$f":"Refrigeration!F55","v":0},{"$f":"Refrigeration!G55","v":0},{"$f":"Refrigeration!I55","v":0},null,{"$f":"Refrigeration!J55","v":0},{"$f":"SelectedZone","v":4},null,null,null,null,null,null,null,{"$f":"Refrigeration!H55","v":0}]
[null,null,null,null,null,null," ",null,"ENERGY STAR Commercial Refrigerators",5,{"$f":"INDEX('Savings Summary'!$Q$8:$Q$51,MATCH('DSMT Export'!I35,'Savings Summary'!$C$8:$C$51,0))","v":"a1r3u000003Fim5AAC"},{"$f":"INDEX('Savings Summary'!$R$8:$R$51,MATCH('DSMT Export'!I35,'Savings Summary'!$C$8:$C$51,0))","v":"0123u000000VQd6AAG"},0,0,{"$f":"ROUND(Refrigeration!B56,3)","v":0},{"$f":"0","v":0},{"$f":"ROUND(MAX(Refrigeration!C56,O35:P35),3)","v":0},{"$f":"ROUND(Refrigeration!D56,0)","v":0},{"$f":"Refrigeration!E56","v":0},{"$f":"Refrigeration!F56","v":0},{"$f":"Refrigeration!G56","v":0},{"$f":"Refrigeration!I56","v":0},null,{"$f":"Refrigeration!J56","v":0},4,null,null,null,null,null,null,null,{"$f":"Refrigeration!H56","v":0}]
[null,null,null,null,null,null,null,null,"Strip Curtains for Walk-In Refrigerated Storage",1,{"$f":"INDEX('Savings Summary'!$Q$8:$Q$51,MATCH('DSMT Export'!I36,'Savings Summary'!$C$8:$C$51,0))","v":"a1r3u000003Fim7AAC"},{"$f":"INDEX('Savings Summary'!$R$8:$R$51,MATCH('DSMT Export'!I36,'Savings Summary'!$C$8:$C$51,0))","v":"0123u000000VQM9AAO"},0,0,{"$f":"ROUND(Refrigeration!B60,3)","v":0},{"$f":"0","v":0},{"$f":"ROUND(MAX(O36:P36,Refrigeration!C60),3)","v":0},{"$f":"ROUND(Refrigeration!D60,0)","v":0},{"$f":"Refrigeration!E60","v":0},{"$f":"Refrigeration!F60","v":0},null,{"$f":"Refrigeration!G60","v":0},null,null,4,{"$f":"Refrigeration!H60","v":0}]
[null,null,null,null,null,null,null,null,"Strip Curtains for Walk-In Refrigerated Storage",2,{"$f":"INDEX('Savings Summary'!$Q$8:$Q$51,MATCH('DSMT Export'!I37,'Savings Summary'!$C$8:$C$51,0))","v":"a1r3u000003Fim7AAC"},{"$f":"INDEX('Savings Summary'!$R$8:$R$51,MATCH('DSMT Export'!I37,'Savings Summary'!$C$8:$C$51,0))","v":"0123u000000VQM9AAO"},0,0,{"$f":"ROUND(Refrigeration!B61,3)","v":0},{"$f":"0","v":0},{"$f":"ROUND(MAX(O37:P37,Refrigeration!C61),3)","v":0},{"$f":"ROUND(Refrigeration!D61,0)","v":0},{"$f":"Refrigeration!E61","v":0},{"$f":"Refrigeration!F61","v":0},null,{"$f":"Refrigeration!G61","v":0},null,null,4,{"$f":"Refrigeration!H61","v":0}]
[null,null,null,null,null,null,null,null,"Strip Curtains for Walk-In Refrigerated Storage",3,{"$f":"INDEX('Savings Summary'!$Q$8:$Q$51,MATCH('DSMT Export'!I38,'Savings Summary'!$C$8:$C$51,0))","v":"a1r3u000003Fim7AAC"},{"$f":"INDEX('Savings Summary'!$R$8:$R$51,MATCH('DSMT Export'!I38,'Savings Summary'!$C$8:$C$51,0))","v":"0123u000000VQM9AAO"},0,0,{"$f":"ROUND(Refrigeration!B62,3)","v":0},{"$f":"0","v":0},{"$f":"ROUND(MAX(O38:P38,Refrigeration!C62),3)","v":0},{"$f":"ROUND(Refrigeration!D62,0)","v":0},{"$f":"Refrigeration!E62","v":0},{"$f":"Refrigeration!F62","v":0},null,{"$f":"Refrigeration!G62","v":0},null,null,4,{"$f":"Refrigeration!H62","v":0}]
[null,null,null,null,null,null,null,null,"Zero-Energy Doors for Refrigerated Cases",1,{"$f":"INDEX('Savings Summary'!$Q$8:$Q$51,MATCH('DSMT Export'!I39,'Savings Summary'!$C$8:$C$51,0))","v":"a1r3u000003FimJAAS"},{"$f":"INDEX('Savings Summary'!$R$8:$R$51,MATCH('DSMT Export'!I39,'Savings Summary'!$C$8:$C$51,0))","v":"0123u000000VQdAAAW"},0,0,{"$f":"ROUND(Refrigeration!B66,3)","v":0},{"$f":"0","v":0},{"$f":"ROUND(MAX(Refrigeration!C66,O39:P39),3)","v":0},{"$f":"ROUND(Refrigeration!D66,0)","v":0},{"$f":"Refrigeration!E66","v":0},null,null,{"$f":"Refrigeration!G66","v":0},null,null,4,null,null,null,null,null,null,{"$f":"Refrigeration!F66","v":0}]
[null,null,null,null,null,null,null,null,"Zero-Energy Doors for Refrigerated Cases",2,{"$f":"INDEX('Savings Summary'!$Q$8:$Q$51,MATCH('DSMT Export'!I40,'Savings Summary'!$C$8:$C$51,0))","v":"a1r3u000003FimJAAS"},{"$f":"INDEX('Savings Summary'!$R$8:$R$51,MATCH('DSMT Export'!I40,'Savings Summary'!$C$8:$C$51,0))","v":"0123u000000VQdAAAW"},0,0,{"$f":"ROUND(Refrigeration!B67,3)","v":0},{"$f":"0","v":0},{"$f":"ROUND(MAX(Refrigeration!C67,O40:P40),3)","v":0},{"$f":"ROUND(Refrigeration!D67,0)","v":0},{"$f":"Refrigeration!E67","v":0},null,null,{"$f":"Refrigeration!G67","v":0},null,null,4,null,null,null,null,null,null,{"$f":"Refrigeration!F67","v":0}]
[null,null,null,null,null,null,null,null,"Zero-Energy Doors for Refrigerated Cases",3,{"$f":"INDEX('Savings Summary'!$Q$8:$Q$51,MATCH('DSMT Export'!I41,'Savings Summary'!$C$8:$C$51,0))","v":"a1r3u000003FimJAAS"},{"$f":"INDEX('Savings Summary'!$R$8:$R$51,MATCH('DSMT Export'!I41,'Savings Summary'!$C$8:$C$51,0))","v":"0123u000000VQdAAAW"},0,0,{"$f":"ROUND(Refrigeration!B68,3)","v":0},{"$f":"0","v":0},{"$f":"ROUND(MAX(Refrigeration!C68,O41:P41),3)","v":0},{"$f":"ROUND(Refrigeration!D68,0)","v":0},{"$f":"Refrigeration!E68","v":0},null,null,{"$f":"Refrigeration!G68","v":0},null,null,4,null,null,null,null,null,null,{"$f":"Refrigeration!F68","v":0}]
[null,null,null,null,null,null,null,null,"Vending Machine Controls",1,{"$f":"INDEX('Savings Summary'!$Q$8:$Q$51,MATCH('DSMT Export'!I42,'Savings Summary'!$C$8:$C$51,0))","v":"a1r3u000003Fim9AAC"},{"$f":"INDEX('Savings Summary'!$R$8:$R$51,MATCH('DSMT Export'!I42,'Savings Summary'!$C$8:$C$51,0))","v":"0123u000000VQdAAAW"},0,0,{"$f":"ROUND(Refrigeration!B72,3)","v":0},{"$f":"0","v":0},{"$f":"ROUND(MAX(O42:P42,Refrigeration!C72),3)","v":0},{"$f":"ROUND(Refrigeration!D72,0)","v":0},{"$f":"Refrigeration!E72","v":0},{"$f":"Refrigeration!F72","v":0},null,null,null,{"$f":"Refrigeration!G72","v":0},4]
[null,null,null,null,null,null,null,null,"Vending Machine Controls",2,{"$f":"INDEX('Savings Summary'!$Q$8:$Q$51,MATCH('DSMT Export'!I43,'Savings Summary'!$C$8:$C$51,0))","v":"a1r3u000003Fim9AAC"},{"$f":"INDEX('Savings Summary'!$R$8:$R$51,MATCH('DSMT Export'!I43,'Savings Summary'!$C$8:$C$51,0))","v":"0123u000000VQdAAAW"},0,0,{"$f":"ROUND(Refrigeration!B73,3)","v":0},{"$f":"0","v":0},{"$f":"ROUND(MAX(O43:P43,Refrigeration!C73),3)","v":0},{"$f":"ROUND(Refrigeration!D73,0)","v":0},{"$f":"Refrigeration!E73","v":0},{"$f":"Refrigeration!F73","v":0},null,null,null,{"$f":"Refrigeration!G73","v":0},4]
[null,null,null,null,null,null,null,null,"Vending Machine Controls",3,{"$f":"INDEX('Savings Summary'!$Q$8:$Q$51,MATCH('DSMT Export'!I44,'Savings Summary'!$C$8:$C$51,0))","v":"a1r3u000003Fim9AAC"},{"$f":"INDEX('Savings Summary'!$R$8:$R$51,MATCH('DSMT Export'!I44,'Savings Summary'!$C$8:$C$51,0))","v":"0123u000000VQdAAAW"},0,0,{"$f":"ROUND(Refrigeration!B74,3)","v":0},{"$f":"0","v":0},{"$f":"ROUND(MAX(O44:P44,Refrigeration!C74),3)","v":0},{"$f":"ROUND(Refrigeration!D74,0)","v":0},{"$f":"Refrigeration!E74","v":0},{"$f":"Refrigeration!F74","v":0},null,null,null,{"$f":"Refrigeration!G74","v":0},4]
[null,null,null,null,null,null,null,null,"High Speed Doors for Cold Storage",1,{"$f":"INDEX('Savings Summary'!$Q$8:$Q$51,MATCH('DSMT Export'!I45,'Savings Summary'!$C$8:$C$51,0))","v":0},{"$f":"INDEX('Savings Summary'!$R$8:$R$51,MATCH('DSMT Export'!I45,'Savings Summary'!$C$8:$C$51,0))","v":0},0,0,{"$f":"ROUND(Refrigeration!B78,3)","v":0},{"$f":"0","v":0},{"$f":"ROUND(MAX(Refrigeration!C78,O45:P45),3)","v":0},{"$f":"ROUND(Refrigeration!D78,0)","v":0},{"$f":"Refrigeration!E78","v":0},{"$f":"Refrigeration!F78","v":0},null,null,null,null,4]
[null,null,null,null,null,null,null,null,"High Speed Doors for Cold Storage",2,{"$f":"INDEX('Savings Summary'!$Q$8:$Q$51,MATCH('DSMT Export'!I46,'Savings Summary'!$C$8:$C$51,0))","v":0},{"$f":"INDEX('Savings Summary'!$R$8:$R$51,MATCH('DSMT Export'!I46,'Savings Summary'!$C$8:$C$51,0))","v":0},0,0,{"$f":"ROUND(Refrigeration!B79,3)","v":0},{"$f":"0","v":0},{"$f":"ROUND(MAX(Refrigeration!C79,O46:P46),3)","v":0},{"$f":"ROUND(Refrigeration!D79,0)","v":0},{"$f":"Refrigeration!E79","v":0},{"$f":"Refrigeration!F79","v":0},null,null,null,null,4]
[null,null,null,null,null,null,null,null,"High Speed Doors for Cold Storage",3,{"$f":"INDEX('Savings Summary'!$Q$8:$Q$51,MATCH('DSMT Export'!I47,'Savings Summary'!$C$8:$C$51,0))","v":0},{"$f":"INDEX('Savings Summary'!$R$8:$R$51,MATCH('DSMT Export'!I47,'Savings Summary'!$C$8:$C$51,0))","v":0},0,0,{"$f":"ROUND(Refrigeration!B80,3)","v":0},{"$f":"0","v":0},{"$f":"ROUND(MAX(Refrigeration!C80,O47:P47),3)","v":0},{"$f":"ROUND(Refrigeration!D80,0)","v":0},{"$f":"Refrigeration!E80","v":0},{"$f":"Refrigeration!F80","v":0},null,null,null,null,4]
[null,null,null,null,null,null,null,null,"ENERGY STAR Electric Convection Oven",1,{"$f":"INDEX('Savings Summary'!$Q$8:$Q$51,MATCH('DSMT Export'!I48,'Savings Summary'!$C$8:$C$51,0))","v":"a1r3u000003FilFAAS"},{"$f":"INDEX('Savings Summary'!$R$8:$R$51,MATCH('DSMT Export'!I48,'Savings Summary'!$C$8:$C$51,0))","v":"0123u000000VQdAAAW"},0,0,{"$f":"ROUND('Food Service & DHW'!B5,3)","v":0},{"$f":"0","v":0},{"$f":"ROUND(MAX(O48:P48,'Food Service & DHW'!C5),3)","v":0},{"$f":"ROUND('Food Service & DHW'!D5,0)","v":0},{"$f":"'Food Service & DHW'!E5","v":0},{"$f":"'Food Service & DHW'!F5","v":0},{"$f":"'Food Service & DHW'!G5","v":0},null,null,null,4,null,null,null,null,null,null,null,null,null,null,null,null,null,null,{"$f":"'Food Service & DHW'!H5","v":0}]
[null,null,null,null,null,null,null,null,"ENERGY STAR Electric Convection Oven",2,{"$f":"INDEX('Savings Summary'!$Q$8:$Q$51,MATCH('DSMT Export'!I49,'Savings Summary'!$C$8:$C$51,0))","v":"a1r3u000003FilFAAS"},{"$f":"INDEX('Savings Summary'!$R$8:$R$51,MATCH('DSMT Export'!I49,'Savings Summary'!$C$8:$C$51,0))","v":"0123u000000VQdAAAW"},0,0,{"$f":"ROUND('Food Service & DHW'!B6,3)","v":0},{"$f":"0","v":0},{"$f":"ROUND(MAX(O49:P49,'Food Service & DHW'!C6),3)","v":0},{"$f":"ROUND('Food Service & DHW'!D6,0)","v":0},{"$f":"'Food Service & DHW'!E6","v":0},{"$f":"'Food Service & DHW'!F6","v":0},{"$f":"'Food Service & DHW'!G6","v":0},null,null,null,4,null,null,null,null,null,null,null,null,null,null,null,null,null,null,{"$f":"'Food Service & DHW'!H6","v":0}]
[null,null,null,null,null,null,null,null,"ENERGY STAR Electric Convection Oven",3,{"$f":"INDEX('Savings Summary'!$Q$8:$Q$51,MATCH('DSMT Export'!I50,'Savings Summary'!$C$8:$C$51,0))","v":"a1r3u000003FilFAAS"},{"$f":"INDEX('Savings Summary'!$R$8:$R$51,MATCH('DSMT Export'!I50,'Savings Summary'!$C$8:$C$51,0))","v":"0123u000000VQdAAAW"},0,0,{"$f":"ROUND('Food Service & DHW'!B7,3)","v":0},{"$f":"0","v":0},{"$f":"ROUND(MAX(O50:P50,'Food Service & DHW'!C7),3)","v":0},{"$f":"ROUND('Food Service & DHW'!D7,0)","v":0},{"$f":"'Food Service & DHW'!E7","v":0},{"$f":"'Food Service & DHW'!F7","v":0},{"$f":"'Food Service & DHW'!G7","v":0},null,null,null,4,null,null,null,null,null,null,null,null,null,null,null,null,null,null,{"$f":"'Food Service & DHW'!H7","v":0}]
[null,null,null,null,null,null,null,null,"ENERGY STAR Combination Oven",1,{"$f":"INDEX('Savings Summary'!$Q$8:$Q$51,MATCH('DSMT Export'!I51,'Savings Summary'!$C$8:$C$51,0))","v":"a1r3u000003FilDAAS"},{"$f":"INDEX('Savings Summary'!$R$8:$R$51,MATCH('DSMT Export'!I51,'Savings Summary'!$C$8:$C$51,0))","v":"0123u000000VQd9AAG"},0,0,{"$f":"ROUND('Food Service & DHW'!B11,3)","v":0},{"$f":"0","v":0},{"$f":"ROUND(MAX(O51:P51,'Food Service & DHW'!C11),3)","v":0},{"$f":"ROUND('Food Service & DHW'!D11,0)","v":0},{"$f":"'Food Service & DHW'!E11","v":0},{"$f":"'Food Service & DHW'!F11","v":0},{"$f":"'Food Service & DHW'!G11","v":0},null,null,null,4,null,null,null,null,null,null,null,null,null,null,null,null,null,null,null,{"$f":"'Food Service & DHW'!H11","v":0}]
[null,null,null,null,null,null,null,null,"ENERGY STAR Combination Oven",2,{"$f":"INDEX('Savings Summary'!$Q$8:$Q$51,MATCH('DSMT Export'!I52,'Savings Summary'!$C$8:$C$51,0))","v":"a1r3u000003FilDAAS"},{"$f":"INDEX('Savings Summary'!$R$8:$R$51,MATCH('DSMT Export'!I52,'Savings Summary'!$C$8:$C$51,0))","v":"0123u000000VQd9AAG"},0,0,{"$f":"'Food Service & DHW'!B12","v":0},{"$f":"0","v":0},{"$f":"ROUND(MAX(O52:P52,'Food Service & DHW'!C12),3)","v":0},{"$f":"ROUND('Food Service & DHW'!D12,0)","v":0},{"$f":"'Food Service & DHW'!E12","v":0},{"$f":"'Food Service & DHW'!F12","v":0},{"$f":"'Food Service & DHW'!G12","v":0},null,null,null,4,null,null,null,null,null,null,null,null,null,null,null,null,null,null,null,{"$f":"'Food Service & DHW'!H12","v":0}]
[null,null,null,null,null,null,null,null,"ENERGY STAR Combination Oven",3,{"$f":"INDEX('Savings Summary'!$Q$8:$Q$51,MATCH('DSMT Export'!I53,'Savings Summary'!$C$8:$C$51,0))","v":"a1r3u000003FilDAAS"},{"$f":"INDEX('Savings Summary'!$R$8:$R$51,MATCH('DSMT Export'!I53,'Savings Summary'!$C$8:$C$51,0))","v":"0123u000000VQd9AAG"},0,0,{"$f":"'Food Service & DHW'!B13","v":0},{"$f":"0","v":0},{"$f":"ROUND(MAX(O53:P53,'Food Service & DHW'!C13),3)","v":0},{"$f":"ROUND('Food Service & DHW'!D13,0)","v":0},{"$f":"'Food Service & DHW'!E13","v":0},{"$f":"'Food Service & DHW'!F13","v":0},{"$f":"'Food Service & DHW'!G13","v":0},null,null,null,4,null,null,null,null,null,null,null,null,null,null,null,null,null,null,null,{"$f":"'Food Service & DHW'!H13","v":0}]
[null,null,null,null,null,null,null,null,"ENERGY STAR Commercial Dishwashers",1,{"$f":"INDEX('Savings Summary'!$Q$8:$Q$51,MATCH('DSMT Export'!I54,'Savings Summary'!$C$8:$C$51,0))","v":"a1r3u000003FikyAAC"},{"$f":"INDEX('Savings Summary'!$R$8:$R$51,MATCH('DSMT Export'!I54,'Savings Summary'!$C$8:$C$51,0))","v":"0123u000000VQd9AAG"},0,0,{"$f":"ROUND('Food Service & DHW'!B17,3)","v":0},{"$f":"0","v":0},{"$f":"ROUND(MAX('Food Service & DHW'!C17,O54:P54),3)","v":0},{"$f":"ROUND('Food Service & DHW'!D17,0)","v":0},{"$f":"'Food Service & DHW'!E17","v":0},{"$f":"'Food Service & DHW'!F17","v":0},{"$f":"'Food Service & DHW'!G17","v":0},{"$f":"'Food Service & DHW'!I17","v":0},null,{"$f":"'Food Service & DHW'!H17","v":0},4]
[null,null,null,null,null,null,null,null,"ENERGY STAR Commercial Dishwashers",2,{"$f":"INDEX('Savings Summary'!$Q$8:$Q$51,MATCH('DSMT Export'!I55,'Savings Summary'!$C$8:$C$51,0))","v":"a1r3u000003FikyAAC"},{"$f":"INDEX('Savings Summary'!$R$8:$R$51,MATCH('DSMT Export'!I55,'Savings Summary'!$C$8:$C$51,0))","v":"0123u000000VQd9AAG"},0,0,{"$f":"ROUND('Food Service & DHW'!B18,3)","v":0},{"$f":"0","v":0},{"$f":"ROUND(MAX('Food Service & DHW'!C18,O55:P55),3)","v":0},{"$f":"ROUND('Food Service & DHW'!D18,0)","v":0},{"$f":"'Food Service & DHW'!E18","v":0},{"$f":"'Food Service & DHW'!F18","v":0},{"$f":"'Food Service & DHW'!G18","v":0},{"$f":"'Food Service & DHW'!I18","v":0},null,{"$f":"'Food Service & DHW'!H18","v":0},4]
[null,null,null,null,null,null,null,null,"ENERGY STAR Commercial Dishwashers",3,{"$f":"INDEX('Savings Summary'!$Q$8:$Q$51,MATCH('DSMT Export'!I56,'Savings Summary'!$C$8:$C$51,0))","v":"a1r3u000003FikyAAC"},{"$f":"INDEX('Savings Summary'!$R$8:$R$51,MATCH('DSMT Export'!I56,'Savings Summary'!$C$8:$C$51,0))","v":"0123u000000VQd9AAG"},0,0,{"$f":"ROUND('Food Service & DHW'!B19,3)","v":0},{"$f":"0","v":0},{"$f":"ROUND(MAX('Food Service & DHW'!C19,O56:P56),3)","v":0},{"$f":"ROUND('Food Service & DHW'!D19,0)","v":0},{"$f":"'Food Service & DHW'!E19","v":0},{"$f":"'Food Service & DHW'!F19","v":0},{"$f":"'Food Service & DHW'!G19","v":0},{"$f":"'Food Service & DHW'!I19","v":0},null,{"$f":"'Food Service & DHW'!H19","v":0},4]
[null,null,null,null,null,null,null,null,"ENERGY STAR Electric Steam Cookers",1,{"$f":"INDEX('Savings Summary'!$Q$8:$Q$51,MATCH('DSMT Export'!I57,'Savings Summary'!$C$8:$C$51,0))","v":"a1r3u000003FilHAAS"},{"$f":"INDEX('Savings Summary'!$R$8:$R$51,MATCH('DSMT Export'!I57,'Savings Summary'!$C$8:$C$51,0))","v":"0123u000000VQdHAAW"},0,0,{"$f":"ROUND('Food Service & DHW'!B23,3)","v":0},{"$f":"0","v":0},{"$f":"ROUND(MAX(O57:P57,'Food Service & DHW'!C23),3)","v":0},{"$f":"ROUND('Food Service & DHW'!D23,0)","v":0},{"$f":"'Food Service & DHW'!E23","v":0},{"$f":"'Food Service & DHW'!F23","v":0},{"$f":"'Food Service & DHW'!G23","v":0},null,null,{"$f":"'Food Service & DHW'!I23","v":0},4,null,null,null,null,null,null,null,null,null,null,null,null,null,null,null,{"$f":"'Food Service & DHW'!H23","v":0}]
[null,null,null,null,null,null,null,null,"ENERGY STAR Electric Steam Cookers",2,{"$f":"INDEX('Savings Summary'!$Q$8:$Q$51,MATCH('DSMT Export'!I58,'Savings Summary'!$C$8:$C$51,0))","v":"a1r3u000003FilHAAS"},{"$f":"INDEX('Savings Summary'!$R$8:$R$51,MATCH('DSMT Export'!I58,'Savings Summary'!$C$8:$C$51,0))","v":"0123u000000VQdHAAW"},0,0,{"$f":"ROUND('Food Service & DHW'!B24,3)","v":0},{"$f":"0","v":0},{"$f":"ROUND(MAX(O58:P58,'Food Service & DHW'!C24),3)","v":0},{"$f":"ROUND('Food Service & DHW'!D24,0)","v":0},{"$f":"'Food Service & DHW'!E24","v":0},{"$f":"'Food Service & DHW'!F24","v":0},{"$f":"'Food Service & DHW'!G24","v":0},null,null,{"$f":"'Food Service & DHW'!I24","v":0},4,null,null,null,null,null,null,null,null,null,null,null,null,null,null,null,{"$f":"'Food Service & DHW'!H24","v":0}]
[null,null,null,null,null,null,null,null,"ENERGY STAR Electric Steam Cookers",3,{"$f":"INDEX('Savings Summary'!$Q$8:$Q$51,MATCH('DSMT Export'!I59,'Savings Summary'!$C$8:$C$51,0))","v":"a1r3u000003FilHAAS"},{"$f":"INDEX('Savings Summary'!$R$8:$R$51,MATCH('DSMT Export'!I59,'Savings Summary'!$C$8:$C$51,0))","v":"0123u000000VQdHAAW"},0,0,{"$f":"ROUND('Food Service & DHW'!B25,3)","v":0},{"$f":"0","v":0},{"$f":"ROUND(MAX(O59:P59,'Food Service & DHW'!C25),3)","v":0},{"$f":"ROUND('Food Service & DHW'!D25,0)","v":0},{"$f":"'Food Service & DHW'!E25","v":0},{"$f":"'Food Service & DHW'!F25","v":0},{"$f":"'Food Service & DHW'!G25","v":0},null,null,{"$f":"'Food Service & DHW'!I25","v":0},4,null,null,null,null,null,null,null,null,null,null,null,null,null,null,null,{"$f":"'Food Service & DHW'!H25","v":0}]
[null,null,null,null,null,null,null,null,"ENERGY STAR Electric Fryers",1,{"$f":"INDEX('Savings Summary'!$Q$8:$Q$51,MATCH('DSMT Export'!I60,'Savings Summary'!$C$8:$C$51,0))","v":"a1r3u000003FileAAC"},{"$f":"INDEX('Savings Summary'!$R$8:$R$51,MATCH('DSMT Export'!I60,'Savings Summary'!$C$8:$C$51,0))","v":"0123u000000VQd2AAG"},0,0,{"$f":"ROUND('Food Service & DHW'!B29,3)","v":0},{"$f":"0","v":0},{"$f":"ROUND(MAX(O60:P60,'Food Service & DHW'!C29),3)","v":0},{"$f":"ROUND('Food Service & DHW'!D29,0)","v":0},{"$f":"'Food Service & DHW'!E29","v":0},{"$f":"'Food Service & DHW'!F29","v":0},{"$f":"'Food Service & DHW'!G29","v":0},null,null,{"$f":"'Food Service & DHW'!H29","v":0},4]
[null,null,null,null,null,null,null,null,"ENERGY STAR Electric Fryers",2,{"$f":"INDEX('Savings Summary'!$Q$8:$Q$51,MATCH('DSMT Export'!I61,'Savings Summary'!$C$8:$C$51,0))","v":"a1r3u000003FileAAC"},{"$f":"INDEX('Savings Summary'!$R$8:$R$51,MATCH('DSMT Export'!I61,'Savings Summary'!$C$8:$C$51,0))","v":"0123u000000VQd2AAG"},0,0,{"$f":"ROUND('Food Service & DHW'!B30,3)","v":0},{"$f":"0","v":0},{"$f":"ROUND(MAX(O61:P61,'Food Service & DHW'!C30),3)","v":0},{"$f":"ROUND('Food Service & DHW'!D30,0)","v":0},{"$f":"'Food Service & DHW'!E30","v":0},{"$f":"'Food Service & DHW'!F30","v":0},{"$f":"'Food Service & DHW'!G30","v":0},null,null,{"$f":"'Food Service & DHW'!H30","v":0},4]
[null,null,null,null,null,null,null,null,"ENERGY STAR Electric Fryers",3,{"$f":"INDEX('Savings Summary'!$Q$8:$Q$51,MATCH('DSMT Export'!I62,'Savings Summary'!$C$8:$C$51,0))","v":"a1r3u000003FileAAC"},{"$f":"INDEX('Savings Summary'!$R$8:$R$51,MATCH('DSMT Export'!I62,'Savings Summary'!$C$8:$C$51,0))","v":"0123u000000VQd2AAG"},0,0,{"$f":"ROUND('Food Service & DHW'!B31,3)","v":0},{"$f":"0","v":0},{"$f":"ROUND(MAX(O62:P62,'Food Service & DHW'!C31),3)","v":0},{"$f":"ROUND('Food Service & DHW'!D31,0)","v":0},{"$f":"'Food Service & DHW'!E31","v":0},{"$f":"'Food Service & DHW'!F31","v":0},{"$f":"'Food Service & DHW'!G31","v":0},null,null,{"$f":"'Food Service & DHW'!H31","v":0},4]
[null,null,null,null,null,null,null,null,"ENERGY STAR Electric Hot Food Holding Cabinets",1,{"$f":"INDEX('Savings Summary'!$Q$8:$Q$51,MATCH('DSMT Export'!I63,'Savings Summary'!$C$8:$C$51,0))","v":"a1r3u000003FilTAAS"},{"$f":"INDEX('Savings Summary'!$R$8:$R$51,MATCH('DSMT Export'!I63,'Savings Summary'!$C$8:$C$51,0))","v":"0123u000000VQdAAAW"},0,0,{"$f":"ROUND('Food Service & DHW'!B35,3)","v":0},{"$f":"0","v":0},{"$f":"ROUND(MAX(O63:P63,'Food Service & DHW'!C35),3)","v":0},{"$f":"ROUND('Food Service & DHW'!D35,0)","v":0},{"$f":"'Food Service & DHW'!E35","v":0},{"$f":"'Food Service & DHW'!F35","v":0},{"$f":"'Food Service & DHW'!G35","v":0},null,null,null,4,null,null,null,null,null,null,null,null,null,null,null,null,null,null,null,null,{"$f":"SUBSTITUTE('Food Service & DHW'!H35,\"≤\",\"<=\")","v":""}]
[null,null,null,null,null,null,null,null,"ENERGY STAR Electric Hot Food Holding Cabinets",2,{"$f":"INDEX('Savings Summary'!$Q$8:$Q$51,MATCH('DSMT Export'!I64,'Savings Summary'!$C$8:$C$51,0))","v":"a1r3u000003FilTAAS"},{"$f":"INDEX('Savings Summary'!$R$8:$R$51,MATCH('DSMT Export'!I64,'Savings Summary'!$C$8:$C$51,0))","v":"0123u000000VQdAAAW"},0,0,{"$f":"ROUND('Food Service & DHW'!B36,3)","v":0},{"$f":"0","v":0},{"$f":"ROUND(MAX(O64:P64,'Food Service & DHW'!C36),3)","v":0},{"$f":"ROUND('Food Service & DHW'!D36,0)","v":0},{"$f":"'Food Service & DHW'!E36","v":0},{"$f":"'Food Service & DHW'!F36","v":0},{"$f":"'Food Service & DHW'!G36","v":0},null,null,null,4,null,null,null,null,null,null,null,null,null,null,null,null,null,null,null,null,{"$f":"SUBSTITUTE('Food Service & DHW'!H36,\"≤\",\"<=\")","v":""}]
[null,null,null,null,null,null,null,null,"ENERGY STAR Electric Hot Food Holding Cabinets",3,{"$f":"INDEX('Savings Summary'!$Q$8:$Q$51,MATCH('DSMT Export'!I65,'Savings Summary'!$C$8:$C$51,0))","v":"a1r3u000003FilTAAS"},{"$f":"INDEX('Savings Summary'!$R$8:$R$51,MATCH('DSMT Export'!I65,'Savings Summary'!$C$8:$C$51,0))","v":"0123u000000VQdAAAW"},0,0,{"$f":"ROUND('Food Service & DHW'!B37,3)","v":0},{"$f":"0","v":0},{"$f":"ROUND(MAX(O65:P65,'Food Service & DHW'!C37),3)","v":0},{"$f":"ROUND('Food Service & DHW'!D37,0)","v":0},{"$f":"'Food Service & DHW'!E37","v":0},{"$f":"'Food Service & DHW'!F37","v":0},{"$f":"'Food Service & DHW'!G37","v":0},null,null,null,4,null,null,null,null,null,null,null,null,null,null,null,null,null,null,null,null,{"$f":"SUBSTITUTE('Food Service & DHW'!H37,\"≤\",\"<=\")","v":""}]
[null,null,null,null,null,null,null,null,"Low Flow Pre-Rinse Spray Valve",1,{"$f":"INDEX('Savings Summary'!$Q$8:$Q$51,MATCH('DSMT Export'!I66,'Savings Summary'!$C$8:$C$51,0))","v":"a1r3u000003FilrAAC"},{"$f":"INDEX('Savings Summary'!$R$8:$R$51,MATCH('DSMT Export'!I66,'Savings Summary'!$C$8:$C$51,0))","v":"0123u000000VQdTAAW"},{"$f":"APID","v":0},{"$f":"EAID","v":0},{"$f":"ROUND('Food Service & DHW'!B41,3)","v":0},{"$f":"0","v":0},{"$f":"ROUND(MAX('Food Service & DHW'!C41,O66:P66),3)","v":0},{"$f":"ROUND('Food Service & DHW'!D41,0)","v":0},{"$f":"'Food Service & DHW'!E41","v":0},{"$f":"'Food Service & DHW'!F41","v":0},null,null,null,null,{"$f":"SelectedZone","v":4},{"$f":"'Food Service & DHW'!G41","v":0},null,null,null,null,null,null,null,null,null,null,null,null,null,null,null,null,null,{"$f":"SUBSTITUTE('Food Service & DHW'!H41,\"≤\",\"<=\")","v":""},{"$f":"'Food Service & DHW'!J41","v":"-"},{"$f":"'Food Service & DHW'!I41","v":0}]
[null,null,null,null,null,null,null,null,"Low Flow Pre-Rinse Spray Valve",2,{"$f":"INDEX('Savings Summary'!$Q$8:$Q$51,MATCH('DSMT Export'!I67,'Savings Summary'!$C$8:$C$51,0))","v":"a1r3u000003FilrAAC"},{"$f":"INDEX('Savings Summary'!$R$8:$R$51,MATCH('DSMT Export'!I67,'Savings Summary'!$C$8:$C$51,0))","v":"0123u000000VQdTAAW"},0,0,{"$f":"ROUND('Food Service & DHW'!B42,3)","v":0},{"$f":"0","v":0},{"$f":"ROUND(MAX('Food Service & DHW'!C42,O67:P67),3)","v":0},{"$f":"ROUND('Food Service & DHW'!D42,0)","v":0},{"$f":"'Food Service & DHW'!E42","v":0},{"$f":"'Food Service & DHW'!F42","v":0},null,null,null,null,4,{"$f":"'Food Service & DHW'!G42","v":0},null,null,null,null,null,null,null,null,null,null,null,null,null,null,null,null,null,{"$f":"SUBSTITUTE('Food Service & DHW'!H42,\"≤\",\"<=\")","v":""},{"$f":"'Food Service & DHW'!J42","v":"-"},{"$f":"'Food Service & DHW'!I42","v":0}]
[null,null,null,null,null,null,null,null,"Low Flow Pre-Rinse Spray Valve",3,{"$f":"INDEX('Savings Summary'!$Q$8:$Q$51,MATCH('DSMT Export'!I68,'Savings Summary'!$C$8:$C$51,0))","v":"a1r3u000003FilrAAC"},{"$f":"INDEX('Savings Summary'!$R$8:$R$51,MATCH('DSMT Export'!I68,'Savings Summary'!$C$8:$C$51,0))","v":"0123u000000VQdTAAW"},0,0,{"$f":"ROUND('Food Service & DHW'!B43,3)","v":0},{"$f":"0","v":0},{"$f":"ROUND(MAX('Food Service & DHW'!C43,O68:P68),3)","v":0},{"$f":"ROUND('Food Service & DHW'!D43,0)","v":0},{"$f":"'Food Service & DHW'!E43","v":0},{"$f":"'Food Service & DHW'!F43","v":0},null,null,null,null,4,{"$f":"'Food Service & DHW'!G43","v":0},null,null,null,null,null,null,null,null,null,null,null,null,null,null,null,null,null,{"$f":"SUBSTITUTE('Food Service & DHW'!H43,\"≤\",\"<=\")","v":""},{"$f":"'Food Service & DHW'!J43","v":"-"},{"$f":"'Food Service & DHW'!I43","v":0}]
[null,null,null,null,null,null,null,null,"Demand Controlled Kitchen Ventilation",1,{"$f":"INDEX('Savings Summary'!$Q$8:$Q$51,MATCH('DSMT Export'!I69,'Savings Summary'!$C$8:$C$51,0))","v":"a1r3u000003FilcAAC"},{"$f":"INDEX('Savings Summary'!$R$8:$R$51,MATCH('DSMT Export'!I69,'Savings Summary'!$C$8:$C$51,0))","v":"0123u000000VQdAAAW"},0,0,{"$f":"ROUND(IF('Food Service & DHW'!S47,'Food Service & DHW'!B47,0),3)","v":0},{"$f":"ROUND(IF('Food Service & DHW'!S47,0,'Food Service & DHW'!B47),3)","v":0},{"$f":"ROUND(MAX('Food Service & DHW'!C47,O69:P69),3)","v":0},{"$f":"ROUND('Food Service & DHW'!D47,0)","v":0},{"$f":"'Food Service & DHW'!E47","v":0},{"$f":"'Food Service & DHW'!F47","v":0},null,null,null,null,4,{"$f":"'Food Service & DHW'!G47","v":0},null,null,null,null,null,null,null,null,null,null,null,null,null,null,null,null,null,null,null,null,null,null,null,null,null,null,null,null,null,null,{"$f":"'Food Service & DHW'!H47","v":0},null,{"$f":"IF('Food Service & DHW'!I47=\"Yes\",\"With dedicated MAU\",\"Without dedicated MAU\")","v":"Without dedicated MAU"}]
[null,null,null,null,null,null,null,null,"Demand Controlled Kitchen Ventilation",2,{"$f":"INDEX('Savings Summary'!$Q$8:$Q$51,MATCH('DSMT Export'!I70,'Savings Summary'!$C$8:$C$51,0))","v":"a1r3u000003FilcAAC"},{"$f":"INDEX('Savings Summary'!$R$8:$R$51,MATCH('DSMT Export'!I70,'Savings Summary'!$C$8:$C$51,0))","v":"0123u000000VQdAAAW"},0,0,{"$f":"ROUND(IF('Food Service & DHW'!S48,'Food Service & DHW'!B48,0),3)","v":0},{"$f":"ROUND(IF('Food Service & DHW'!S48,0,'Food Service & DHW'!B48),3)","v":0},{"$f":"ROUND(MAX('Food Service & DHW'!C48,O70:P70),3)","v":0},{"$f":"ROUND('Food Service & DHW'!D48,0)","v":0},{"$f":"'Food Service & DHW'!E48","v":0},{"$f":"'Food Service & DHW'!F48","v":0},null,null,null,null,4,{"$f":"'Food Service & DHW'!G48","v":0},null,null,null,null,null,null,null,null,null,null,null,null,null,null,null,null,null,null,null,null,null,null,null,null,null,null,null,null,null,null,{"$f":"'Food Service & DHW'!H48","v":0},null,{"$f":"IF('Food Service & DHW'!I48=\"Yes\",\"With dedicated MAU\",\"Without dedicated MAU\")","v":"Without dedicated MAU"}]
[null,null,null,null,null,null,null,null,"Demand Controlled Kitchen Ventilation",3,{"$f":"INDEX('Savings Summary'!$Q$8:$Q$51,MATCH('DSMT Export'!I71,'Savings Summary'!$C$8:$C$51,0))","v":"a1r3u000003FilcAAC"},{"$f":"INDEX('Savings Summary'!$R$8:$R$51,MATCH('DSMT Export'!I71,'Savings Summary'!$C$8:$C$51,0))","v":"0123u000000VQdAAAW"},0,0,{"$f":"ROUND(IF('Food Service & DHW'!S49,'Food Service & DHW'!B49,0),3)","v":0},{"$f":"ROUND(IF('Food Service & DHW'!S49,0,'Food Service & DHW'!B49),3)","v":0},{"$f":"ROUND(MAX('Food Service & DHW'!C49,O71:P71),3)","v":0},{"$f":"ROUND('Food Service & DHW'!D49,0)","v":0},{"$f":"'Food Service & DHW'!E49","v":0},{"$f":"'Food Service & DHW'!F49","v":0},null,null,null,null,4,{"$f":"'Food Service & DHW'!G49","v":0},null,null,null,null,null,null,null,null,null,null,null,null,null,null,null,null,null,null,null,null,null,null,null,null,null,null,null,null,null,null,{"$f":"'Food Service & DHW'!H49","v":0},null,{"$f":"IF('Food Service & DHW'!I49=\"Yes\",\"With dedicated MAU\",\"Without dedicated MAU\")","v":"Without dedicated MAU"}]
[null,null,null,null,null,null,null,null,"Demand Controlled Kitchen Ventilation",4,{"$f":"INDEX('Savings Summary'!$Q$8:$Q$51,MATCH('DSMT Export'!I72,'Savings Summary'!$C$8:$C$51,0))","v":"a1r3u000003FilcAAC"},{"$f":"INDEX('Savings Summary'!$R$8:$R$51,MATCH('DSMT Export'!I72,'Savings Summary'!$C$8:$C$51,0))","v":"0123u000000VQdAAAW"},0,0,{"$f":"ROUND(IF('Food Service & DHW'!S50,'Food Service & DHW'!B50,0),3)","v":0},{"$f":"ROUND(IF('Food Service & DHW'!S50,0,'Food Service & DHW'!B50),3)","v":0},{"$f":"ROUND(MAX('Food Service & DHW'!C50,O72:P72),3)","v":0},{"$f":"ROUND('Food Service & DHW'!D50,0)","v":0},{"$f":"'Food Service & DHW'!E50","v":0},{"$f":"'Food Service & DHW'!F50","v":0},null,null,null,null,4,{"$f":"'Food Service & DHW'!G50","v":0},null,null,null,null,null,null,null,null,null,null,null,null,null,null,null,null,null,null,null,null,null,null,null,null,null,null,null,null,null,null,{"$f":"'Food Service & DHW'!H50","v":0},null,{"$f":"IF('Food Service & DHW'!I50=\"Yes\",\"With dedicated MAU\",\"Without dedicated MAU\")","v":"Without dedicated MAU"}]
[null,null,null,null,null,null,null,null,"Demand Controlled Kitchen Ventilation",5,{"$f":"INDEX('Savings Summary'!$Q$8:$Q$51,MATCH('DSMT Export'!I73,'Savings Summary'!$C$8:$C$51,0))","v":"a1r3u000003FilcAAC"},{"$f":"INDEX('Savings Summary'!$R$8:$R$51,MATCH('DSMT Export'!I73,'Savings Summary'!$C$8:$C$51,0))","v":"0123u000000VQdAAAW"},0,0,{"$f":"ROUND(IF('Food Service & DHW'!S51,'Food Service & DHW'!B51,0),3)","v":0},{"$f":"ROUND(IF('Food Service & DHW'!S51,0,'Food Service & DHW'!B51),3)","v":0},{"$f":"ROUND(MAX('Food Service & DHW'!C51,O73:P73),3)","v":0},{"$f":"ROUND('Food Service & DHW'!D51,0)","v":0},{"$f":"'Food Service & DHW'!E51","v":0},{"$f":"'Food Service & DHW'!F51","v":0},null,null,null,null,4,{"$f":"'Food Service & DHW'!G51","v":0},null,null,null,null,null,null,null,null,null,null,null,null,null,null,null,null,null,null,null,null,null,null,null,null,null,null,null,null,null,null,{"$f":"'Food Service & DHW'!H51","v":0},null,{"$f":"IF('Food Service & DHW'!I51=\"Yes\",\"With dedicated MAU\",\"Without dedicated MAU\")","v":"Without dedicated MAU"}]
[null,null,null,null,null,null,null,null,"ENERGY STAR Commercial Ice Makers",1,{"$f":"INDEX('Savings Summary'!$Q$8:$Q$51,MATCH('DSMT Export'!I74,'Savings Summary'!$C$8:$C$51,0))","v":"a1r3u000003Fil0AAC"},{"$f":"INDEX('Savings Summary'!$R$8:$R$51,MATCH('DSMT Export'!I74,'Savings Summary'!$C$8:$C$51,0))","v":"0123u000000VQd9AAG"},0,0,{"$f":"ROUND('Food Service & DHW'!B55,3)","v":0},{"$f":"0","v":0},{"$f":"ROUND(MAX(O74:P74,'Food Service & DHW'!C55),3)","v":0},{"$f":"ROUND('Food Service & DHW'!D55,0)","v":0},{"$f":"'Food Service & DHW'!E55","v":0},{"$f":"'Food Service & DHW'!F55","v":0},{"$f":"'Food Service & DHW'!G55","v":0},null,null,null,4,null,null,null,null,null,null,null,null,null,null,null,null,null,null,null,null,null,null,null,null,null,{"$f":"'Food Service & DHW'!H55","v":0},{"$f":"'Food Service & DHW'!I55","v":0},{"$f":"'Food Service & DHW'!J55","v":0},{"$f":"'Food Service & DHW'!K55","v":0}]
[null,null,null,null,null,null,null,null,"ENERGY STAR Commercial Ice Makers",2,{"$f":"INDEX('Savings Summary'!$Q$8:$Q$51,MATCH('DSMT Export'!I75,'Savings Summary'!$C$8:$C$51,0))","v":"a1r3u000003Fil0AAC"},{"$f":"INDEX('Savings Summary'!$R$8:$R$51,MATCH('DSMT Export'!I75,'Savings Summary'!$C$8:$C$51,0))","v":"0123u000000VQd9AAG"},0,0,{"$f":"ROUND('Food Service & DHW'!B56,3)","v":0},{"$f":"0","v":0},{"$f":"ROUND(MAX(O75:P75,'Food Service & DHW'!C56),3)","v":0},{"$f":"ROUND('Food Service & DHW'!D56,0)","v":0},{"$f":"'Food Service & DHW'!E56","v":0},{"$f":"'Food Service & DHW'!F56","v":0},{"$f":"'Food Service & DHW'!G56","v":0},null,null,null,4,null,null,null,null,null,null,null,null,null,null,null,null,null,null,null,null,null,null,null,null,null,{"$f":"'Food Service & DHW'!H56","v":0},{"$f":"'Food Service & DHW'!I56","v":0},{"$f":"'Food Service & DHW'!J56","v":0},{"$f":"'Food Service & DHW'!K56","v":0}]
[null,null,null,null,null,null,null,null,"ENERGY STAR Commercial Ice Makers",3,{"$f":"INDEX('Savings Summary'!$Q$8:$Q$51,MATCH('DSMT Export'!I76,'Savings Summary'!$C$8:$C$51,0))","v":"a1r3u000003Fil0AAC"},{"$f":"INDEX('Savings Summary'!$R$8:$R$51,MATCH('DSMT Export'!I76,'Savings Summary'!$C$8:$C$51,0))","v":"0123u000000VQd9AAG"},0,0,{"$f":"ROUND('Food Service & DHW'!B57,3)","v":0},{"$f":"0","v":0},{"$f":"ROUND(MAX(O76:P76,'Food Service & DHW'!C57),3)","v":0},{"$f":"ROUND('Food Service & DHW'!D57,0)","v":0},{"$f":"'Food Service & DHW'!E57","v":0},{"$f":"'Food Service & DHW'!F57","v":0},{"$f":"'Food Service & DHW'!G57","v":0},null,null,null,4,null,null,null,null,null,null,null,null,null,null,null,null,null,null,null,null,null,null,null,null,null,{"$f":"'Food Service & DHW'!H57","v":0},{"$f":"'Food Service & DHW'!I57","v":0},{"$f":"'Food Service & DHW'!J57","v":0},{"$f":"'Food Service & DHW'!K57","v":0}]
[null,null,null,null,null,null,null,null,"ENERGY STAR Commercial Ice Makers",4,{"$f":"INDEX('Savings Summary'!$Q$8:$Q$51,MATCH('DSMT Export'!I77,'Savings Summary'!$C$8:$C$51,0))","v":"a1r3u000003Fil0AAC"},{"$f":"INDEX('Savings Summary'!$R$8:$R$51,MATCH('DSMT Export'!I77,'Savings Summary'!$C$8:$C$51,0))","v":"0123u000000VQd9AAG"},0,0,{"$f":"ROUND('Food Service & DHW'!B58,3)","v":0},{"$f":"0","v":0},{"$f":"ROUND(MAX(O77:P77,'Food Service & DHW'!C58),3)","v":0},{"$f":"ROUND('Food Service & DHW'!D58,0)","v":0},{"$f":"'Food Service & DHW'!E58","v":0},{"$f":"'Food Service & DHW'!F58","v":0},{"$f":"'Food Service & DHW'!G58","v":0},null,null,null,4,null,null,null,null,null,null,null,null,null,null,null,null,null,null,null,null,null,null,null,null,null,{"$f":"'Food Service & DHW'!H58","v":0},{"$f":"'Food Service & DHW'!I58","v":0},{"$f":"'Food Service & DHW'!J58","v":0},{"$f":"'Food Service & DHW'!K58","v":0}]
[null,null,null,null,null,null,null,null,"ENERGY STAR Commercial Ice Makers",5,{"$f":"INDEX('Savings Summary'!$Q$8:$Q$51,MATCH('DSMT Export'!I78,'Savings Summary'!$C$8:$C$51,0))","v":"a1r3u000003Fil0AAC"},{"$f":"INDEX('Savings Summary'!$R$8:$R$51,MATCH('DSMT Export'!I78,'Savings Summary'!$C$8:$C$51,0))","v":"0123u000000VQd9AAG"},0,0,{"$f":"ROUND('Food Service & DHW'!B59,3)","v":0},{"$f":"0","v":0},{"$f":"ROUND(MAX(O78:P78,'Food Service & DHW'!C59),3)","v":0},{"$f":"ROUND('Food Service & DHW'!D59,0)","v":0},{"$f":"'Food Service & DHW'!E59","v":0},{"$f":"'Food Service & DHW'!F59","v":0},{"$f":"'Food Service & DHW'!G59","v":0},null,null,null,4,null,null,null,null,null,null,null,null,null,null,null,null,null,null,null,null,null,null,null,null,null,{"$f":"'Food Service & DHW'!H59","v":0},{"$f":"'Food Service & DHW'!I59","v":0},{"$f":"'Food Service & DHW'!J59","v":0},{"$f":"'Food Service & DHW'!K59","v":0}]
[null,null,null,null,null,null,null,null,"Vacuum-Sealing & Packaging Machines",1,{"$f":"INDEX('Savings Summary'!$Q$8:$Q$51,MATCH('DSMT Export'!I79,'Savings Summary'!$C$8:$C$51,0))","v":0},{"$f":"INDEX('Savings Summary'!$R$8:$R$51,MATCH('DSMT Export'!I79,'Savings Summary'!$C$8:$C$51,0))","v":0},0,0,{"$f":"ROUND('Food Service & DHW'!B63,3)","v":0},{"$f":"0","v":0},{"$f":"ROUND(MAX(O79:P79,'Food Service & DHW'!C63),3)","v":0},{"$f":"ROUND('Food Service & DHW'!D63,0)","v":0},{"$f":"'Food Service & DHW'!E64","v":0},{"$f":"'Food Service & DHW'!F63","v":0},null,null,null,null,4]
[null,null,null,null,null,null,null,null,"Low Flow Faucet Aerators",1,{"$f":"INDEX('Savings Summary'!$Q$8:$Q$51,MATCH('DSMT Export'!I80,'Savings Summary'!$C$8:$C$51,0))","v":0},{"$f":"INDEX('Savings Summary'!$R$8:$R$51,MATCH('DSMT Export'!I80,'Savings Summary'!$C$8:$C$51,0))","v":0},0,0,{"$f":"ROUND('Food Service & DHW'!B67,3)","v":0},{"$f":"0","v":0},{"$f":"ROUND(MAX(O80:P80,'Food Service & DHW'!C67),3)","v":0},{"$f":"ROUND('Food Service & DHW'!D67,0)","v":0},{"$f":"'Food Service & DHW'!E67","v":0},{"$f":"'Food Service & DHW'!F67","v":0},null,null,null,{"$f":"'Food Service & DHW'!H67","v":0},4,{"$f":"'Food Service & DHW'!G67","v":0},null,null,null,null,null,null,null,null,null,null,null,null,null,null,null,null,null,null,null,{"$f":"'Food Service & DHW'!I67","v":0}]
[null,null,null,null,null,null,null,null,"Low Flow Faucet Aerators",2,{"$f":"INDEX('Savings Summary'!$Q$8:$Q$51,MATCH('DSMT Export'!I81,'Savings Summary'!$C$8:$C$51,0))","v":0},{"$f":"INDEX('Savings Summary'!$R$8:$R$51,MATCH('DSMT Export'!I81,'Savings Summary'!$C$8:$C$51,0))","v":0},0,0,{"$f":"ROUND('Food Service & DHW'!B68,3)","v":0},{"$f":"0","v":0},{"$f":"ROUND(MAX(O81:P81,'Food Service & DHW'!C68),3)","v":0},{"$f":"ROUND('Food Service & DHW'!D68,0)","v":0},{"$f":"'Food Service & DHW'!E68","v":0},{"$f":"'Food Service & DHW'!F68","v":0},null,null,null,{"$f":"'Food Service & DHW'!H68","v":0},4,{"$f":"'Food Service & DHW'!G68","v":0},null,null,null,null,null,null,null,null,null,null,null,null,null,null,null,null,null,null,null,{"$f":"'Food Service & DHW'!I68","v":0}]
[null,null,null,null,null,null,null,null,"Low Flow Faucet Aerators",3,{"$f":"INDEX('Savings Summary'!$Q$8:$Q$51,MATCH('DSMT Export'!I82,'Savings Summary'!$C$8:$C$51,0))","v":0},{"$f":"INDEX('Savings Summary'!$R$8:$R$51,MATCH('DSMT Export'!I82,'Savings Summary'!$C$8:$C$51,0))","v":0},0,0,{"$f":"ROUND('Food Service & DHW'!B69,3)","v":0},{"$f":"0","v":0},{"$f":"ROUND(MAX(O82:P82,'Food Service & DHW'!C69),3)","v":0},{"$f":"ROUND('Food Service & DHW'!D69,0)","v":0},{"$f":"'Food Service & DHW'!E69","v":0},{"$f":"'Food Service & DHW'!F69","v":0},null,null,null,{"$f":"'Food Service & DHW'!H69","v":0},4,{"$f":"'Food Service & DHW'!G69","v":0},null,null,null,null,null,null,null,null,null,null,null,null,null,null,null,null,null,null,null,{"$f":"'Food Service & DHW'!I69","v":0}]
[null,null,null,null,null,null,null,null,"Low Flow Showerheads",1,{"$f":"INDEX('Savings Summary'!$Q$8:$Q$51,MATCH('DSMT Export'!I83,'Savings Summary'!$C$8:$C$51,0))","v":0},{"$f":"INDEX('Savings Summary'!$R$8:$R$51,MATCH('DSMT Export'!I83,'Savings Summary'!$C$8:$C$51,0))","v":0},0,0,{"$f":"ROUND('Food Service & DHW'!B73,3)","v":0},{"$f":"0","v":0},{"$f":"ROUND(MAX(O83:P83,'Food Service & DHW'!C73),3)","v":0},{"$f":"ROUND('Food Service & DHW'!D73,0)","v":0},{"$f":"'Food Service & DHW'!E73","v":0},{"$f":"'Food Service & DHW'!F73","v":0},null,null,null,{"$f":"'Food Service & DHW'!H73","v":0},4,{"$f":"'Food Service & DHW'!G73","v":0},null,null,null,null,null,null,null,null,null,null,null,null,null,null,null,null,null,null,null,{"$f":"'Food Service & DHW'!I73","v":0}]
[null,null,null,null,null,null,null,null,"Low Flow Showerheads",2,{"$f":"INDEX('Savings Summary'!$Q$8:$Q$51,MATCH('DSMT Export'!I84,'Savings Summary'!$C$8:$C$51,0))","v":0},{"$f":"INDEX('Savings Summary'!$R$8:$R$51,MATCH('DSMT Export'!I84,'Savings Summary'!$C$8:$C$51,0))","v":0},0,0,{"$f":"ROUND('Food Service & DHW'!B74,3)","v":0},{"$f":"0","v":0},{"$f":"ROUND(MAX(O84:P84,'Food Service & DHW'!C74),3)","v":0},{"$f":"ROUND('Food Service & DHW'!D74,0)","v":0},{"$f":"'Food Service & DHW'!E74","v":0},{"$f":"'Food Service & DHW'!F74","v":0},null,null,null,{"$f":"'Food Service & DHW'!H74","v":0},4,{"$f":"'Food Service & DHW'!G74","v":0},null,null,null,null,null,null,null,null,null,null,null,null,null,null,null,null,null,null,null,{"$f":"'Food Service & DHW'!I74","v":0}]
[null,null,null,null,null,null,null,null,"Low Flow Showerheads",3,{"$f":"INDEX('Savings Summary'!$Q$8:$Q$51,MATCH('DSMT Export'!I85,'Savings Summary'!$C$8:$C$51,0))","v":0},{"$f":"INDEX('Savings Summary'!$R$8:$R$51,MATCH('DSMT Export'!I85,'Savings Summary'!$C$8:$C$51,0))","v":0},0,0,{"$f":"ROUND('Food Service & DHW'!B75,3)","v":0},{"$f":"0","v":0},{"$f":"ROUND(MAX(O85:P85,'Food Service & DHW'!C75),3)","v":0},{"$f":"ROUND('Food Service & DHW'!D75,0)","v":0},{"$f":"'Food Service & DHW'!E75","v":0},{"$f":"'Food Service & DHW'!F75","v":0},null,null,null,{"$f":"'Food Service & DHW'!H75","v":0},4,{"$f":"'Food Service & DHW'!G75","v":0},null,null,null,null,null,null,null,null,null,null,null,null,null,null,null,null,null,null,null,{"$f":"'Food Service & DHW'!I75","v":0}]
[null,null,null,null,null,null,null,null,"Temperature-Sensitive Restrictor Valves for Showers",1,{"$f":"INDEX('Savings Summary'!$Q$8:$Q$51,MATCH('DSMT Export'!I86,'Savings Summary'!$C$8:$C$51,0))","v":0},{"$f":"INDEX('Savings Summary'!$R$8:$R$51,MATCH('DSMT Export'!I86,'Savings Summary'!$C$8:$C$51,0))","v":0},0,0,{"$f":"ROUND(IF('Food Service & DHW'!Y79,'Food Service & DHW'!B79,0),3)","v":0},{"$f":"ROUND(IF('Food Service & DHW'!Y79,0,'Food Service & DHW'!B79),3)","v":0},{"$f":"ROUND(MAX(O86:P86,'Food Service & DHW'!C79),3)","v":0},{"$f":"ROUND('Food Service & DHW'!D79,0)","v":0},{"$f":"'Food Service & DHW'!E79","v":0},{"$f":"'Food Service & DHW'!F79","v":0},null,null,null,null,4]
[null,null,null,null,null,null,null,null,"Temperature-Sensitive Restrictor Valves for Showers",2,{"$f":"INDEX('Savings Summary'!$Q$8:$Q$51,MATCH('DSMT Export'!I87,'Savings Summary'!$C$8:$C$51,0))","v":0},{"$f":"INDEX('Savings Summary'!$R$8:$R$51,MATCH('DSMT Export'!I87,'Savings Summary'!$C$8:$C$51,0))","v":0},0,0,{"$f":"ROUND(IF('Food Service & DHW'!Y80,'Food Service & DHW'!B80,0),3)","v":0},{"$f":"ROUND(IF('Food Service & DHW'!Y80,0,'Food Service & DHW'!B80),3)","v":0},{"$f":"ROUND(MAX(O87:P87,'Food Service & DHW'!C80),3)","v":0},{"$f":"ROUND('Food Service & DHW'!D80,0)","v":0},{"$f":"'Food Service & DHW'!E80","v":0},{"$f":"'Food Service & DHW'!F80","v":0},null,null,null,null,4]
[null,null,null,null,null,null,null,null,"Temperature-Sensitive Restrictor Valves for Showers",3,{"$f":"INDEX('Savings Summary'!$Q$8:$Q$51,MATCH('DSMT Export'!I88,'Savings Summary'!$C$8:$C$51,0))","v":0},{"$f":"INDEX('Savings Summary'!$R$8:$R$51,MATCH('DSMT Export'!I88,'Savings Summary'!$C$8:$C$51,0))","v":0},0,0,{"$f":"ROUND(IF('Food Service & DHW'!Y81,'Food Service & DHW'!B81,0),3)","v":0},{"$f":"ROUND(IF('Food Service & DHW'!Y81,0,'Food Service & DHW'!B81),3)","v":0},{"$f":"ROUND(MAX(O88:P88,'Food Service & DHW'!C81),3)","v":0},{"$f":"ROUND('Food Service & DHW'!D81,0)","v":0},{"$f":"'Food Service & DHW'!E81","v":0},{"$f":"'Food Service & DHW'!F81","v":0},null,null,null,null,4]
[null,null,null,null,null,null,null,null,"Central Domestic Hot Water (DHW) Controls",1,{"$f":"INDEX('Savings Summary'!$Q$8:$Q$51,MATCH('DSMT Export'!I89,'Savings Summary'!$C$8:$C$51,0))","v":0},{"$f":"INDEX('Savings Summary'!$R$8:$R$51,MATCH('DSMT Export'!I89,'Savings Summary'!$C$8:$C$51,0))","v":0},0,0,{"$f":"ROUND(IF('Food Service & DHW'!U85,'Food Service & DHW'!B85,0),3)","v":0},{"$f":"ROUND(IF('Food Service & DHW'!U85,0,'Food Service & DHW'!B85),3)","v":0},{"$f":"ROUND(MAX(O89:P89,'Food Service & DHW'!C85),3)","v":0},{"$f":"ROUND('Food Service & DHW'!D85,0)","v":0},{"$f":"'Food Service & DHW'!E85","v":0},null,null,null,null,null,4]
[null,null,null,null,null,null,null,null,"Central Domestic Hot Water (DHW) Controls",2,{"$f":"INDEX('Savings Summary'!$Q$8:$Q$51,MATCH('DSMT Export'!I90,'Savings Summary'!$C$8:$C$51,0))","v":0},{"$f":"INDEX('Savings Summary'!$R$8:$R$51,MATCH('DSMT Export'!I90,'Savings Summary'!$C$8:$C$51,0))","v":0},0,0,{"$f":"ROUND(IF('Food Service & DHW'!U86,'Food Service & DHW'!B86,0),3)","v":0},{"$f":"ROUND(IF('Food Service & DHW'!U86,0,'Food Service & DHW'!B86),3)","v":0},{"$f":"ROUND(MAX(O90:P90,'Food Service & DHW'!C86),3)","v":0},{"$f":"ROUND('Food Service & DHW'!D86,0)","v":0},{"$f":"'Food Service & DHW'!E86","v":0},null,null,null,null,null,4]
[null,null,null,null,null,null,null,null,"Central Domestic Hot Water (DHW) Controls",3,{"$f":"INDEX('Savings Summary'!$Q$8:$Q$51,MATCH('DSMT Export'!I91,'Savings Summary'!$C$8:$C$51,0))","v":0},{"$f":"INDEX('Savings Summary'!$R$8:$R$51,MATCH('DSMT Export'!I91,'Savings Summary'!$C$8:$C$51,0))","v":0},0,0,{"$f":"ROUND(IF('Food Service & DHW'!U87,'Food Service & DHW'!B87,0),3)","v":0},{"$f":"ROUND(IF('Food Service & DHW'!U87,0,'Food Service & DHW'!B87),3)","v":0},{"$f":"ROUND(MAX(O91:P91,'Food Service & DHW'!C87),3)","v":0},{"$f":"ROUND('Food Service & DHW'!D87,0)","v":0},{"$f":"'Food Service & DHW'!E87","v":0},null,null,null,null,null,4]
[null,null,null,null,null,null,null,null,"Central Domestic Hot Water (DHW) Controls",4,{"$f":"INDEX('Savings Summary'!$Q$8:$Q$51,MATCH('DSMT Export'!I92,'Savings Summary'!$C$8:$C$51,0))","v":0},{"$f":"INDEX('Savings Summary'!$R$8:$R$51,MATCH('DSMT Export'!I92,'Savings Summary'!$C$8:$C$51,0))","v":0},0,0,{"$f":"ROUND(IF('Food Service & DHW'!U88,'Food Service & DHW'!B88,0),3)","v":0},{"$f":"ROUND(IF('Food Service & DHW'!U88,0,'Food Service & DHW'!B88),3)","v":0},{"$f":"ROUND(MAX(O92:P92,'Food Service & DHW'!C88),3)","v":0},{"$f":"ROUND('Food Service & DHW'!D88,0)","v":0},{"$f":"'Food Service & DHW'!E88","v":0},null,null,null,null,null,4]
[null,null,null,null,null,null,null,null,"Cool Roofs",1,{"$f":"INDEX('Savings Summary'!$Q$8:$Q$51,MATCH('DSMT Export'!I93,'Savings Summary'!$C$8:$C$51,0))","v":"a1r3u000003Fil4AAC"},{"$f":"INDEX('Savings Summary'!$R$8:$R$51,MATCH('DSMT Export'!I93,'Savings Summary'!$C$8:$C$51,0))","v":"0123u000000VQdDAAW"},0,0,{"$f":"ROUND('HVAC & Envelope'!B5,3)","v":0},{"$f":"0","v":0},{"$f":"ROUND(MAX(O93:P93,'HVAC & Envelope'!C5),3)","v":0},{"$f":"ROUND('HVAC & Envelope'!D5,0)","v":0},{"$f":"'HVAC & Envelope'!E5","v":0},null,null,null,null,null,4,{"$f":"'HVAC & Envelope'!F5","v":0},null,{"$f":"'HVAC & Envelope'!G5","v":0},null,null,null,null,null,null,null,null,null,null,null,null,null,null,null,null,null,null,null,null,null,null,{"$f":"'HVAC & Envelope'!J5","v":0},{"$f":"'HVAC & Envelope'!O5","v":{"$error":"#N/A"}},null,null,null,{"$f":"'HVAC & Envelope'!H5","v":0},{"$f":"'HVAC & Envelope'!I5","v":0}]
[null,null,null,null,null,null,null,null,"Cool Roofs",2,{"$f":"INDEX('Savings Summary'!$Q$8:$Q$51,MATCH('DSMT Export'!I94,'Savings Summary'!$C$8:$C$51,0))","v":"a1r3u000003Fil4AAC"},{"$f":"INDEX('Savings Summary'!$R$8:$R$51,MATCH('DSMT Export'!I94,'Savings Summary'!$C$8:$C$51,0))","v":"0123u000000VQdDAAW"},0,0,{"$f":"ROUND('HVAC & Envelope'!B6,3)","v":0},{"$f":"0","v":0},{"$f":"ROUND(MAX(O94:P94,'HVAC & Envelope'!C6),3)","v":0},{"$f":"ROUND('HVAC & Envelope'!D6,0)","v":0},{"$f":"'HVAC & Envelope'!E6","v":0},null,null,null,null,null,4,{"$f":"'HVAC & Envelope'!F6","v":0},null,{"$f":"'HVAC & Envelope'!G6","v":0},null,null,null,null,null,null,null,null,null,null,null,null,null,null,null,null,null,null,null,null,null,null,{"$f":"'HVAC & Envelope'!J6","v":0},{"$f":"'HVAC & Envelope'!O6","v":{"$error":"#N/A"}},null,null,null,{"$f":"'HVAC & Envelope'!H6","v":0},{"$f":"'HVAC & Envelope'!I6","v":0}]
[null,null,null,null,null,null,null,null,"Cool Roofs",3,{"$f":"INDEX('Savings Summary'!$Q$8:$Q$51,MATCH('DSMT Export'!I95,'Savings Summary'!$C$8:$C$51,0))","v":"a1r3u000003Fil4AAC"},{"$f":"INDEX('Savings Summary'!$R$8:$R$51,MATCH('DSMT Export'!I95,'Savings Summary'!$C$8:$C$51,0))","v":"0123u000000VQdDAAW"},0,0,{"$f":"ROUND('HVAC & Envelope'!B7,3)","v":0},{"$f":"0","v":0},{"$f":"ROUND(MAX(O95:P95,'HVAC & Envelope'!C7),3)","v":0},{"$f":"ROUND('HVAC & Envelope'!D7,0)","v":0},{"$f":"'HVAC & Envelope'!E7","v":0},null,null,null,null,null,4,{"$f":"'HVAC & Envelope'!F7","v":0},null,{"$f":"'HVAC & Envelope'!G7","v":0},null,null,null,null,null,null,null,null,null,null,null,null,null,null,null,null,null,null,null,null,null,null,{"$f":"'HVAC & Envelope'!J7","v":0},{"$f":"'HVAC & Envelope'!O7","v":{"$error":"#N/A"}},null,null,null,{"$f":"'HVAC & Envelope'!H7","v":0},{"$f":"'HVAC & Envelope'!I7","v":0}]
[null,null,null,null,null,null,null,null,"Entrance & Exit Door Air Infiltration",1,{"$f":"INDEX('Savings Summary'!$Q$8:$Q$51,MATCH('DSMT Export'!I96,'Savings Summary'!$C$8:$C$51,0))","v":"a1r3u000003FilMAAS"},{"$f":"INDEX('Savings Summary'!$R$8:$R$51,MATCH('DSMT Export'!I96,'Savings Summary'!$C$8:$C$51,0))","v":"0123u000000VQdKAAW"},0,0,{"$f":"ROUND(IF('HVAC & Envelope'!T11,'HVAC & Envelope'!B11,0),3)","v":0},{"$f":"ROUND(IF('HVAC & Envelope'!T11,0,'HVAC & Envelope'!B11),3)","v":0},{"$f":"ROUND(MAX(O96:P96,'HVAC & Envelope'!C11),3)","v":0},{"$f":"ROUND('HVAC & Envelope'!D11,0)","v":0},{"$f":"'HVAC & Envelope'!E11","v":0},{"$f":"'HVAC & Envelope'!F11","v":0},null,null,null,{"$f":"'HVAC & Envelope'!G11","v":0},4,null,null,null,null,null,null,{"$f":"'HVAC & Envelope'!M11","v":0},null,null,null,null,null,null,null,null,null,null,{"$f":"TEXT('HVAC & Envelope'!I11,\"# ?/?\")","v":"0    "},null,null,null,null,null,null,null,null,null,null,{"$f":"'HVAC & Envelope'!J11","v":0}]
[null,null,null,null,null,null,null,null,"Entrance & Exit Door Air Infiltration",2,{"$f":"INDEX('Savings Summary'!$Q$8:$Q$51,MATCH('DSMT Export'!I97,'Savings Summary'!$C$8:$C$51,0))","v":"a1r3u000003FilMAAS"},{"$f":"INDEX('Savings Summary'!$R$8:$R$51,MATCH('DSMT Export'!I97,'Savings Summary'!$C$8:$C$51,0))","v":"0123u000000VQdKAAW"},0,0,{"$f":"ROUND(IF('HVAC & Envelope'!T12,'HVAC & Envelope'!B12,0),3)","v":0},{"$f":"ROUND(IF('HVAC & Envelope'!T12,0,'HVAC & Envelope'!B12),3)","v":0},{"$f":"ROUND(MAX(O97:P97,'HVAC & Envelope'!C12),3)","v":0},{"$f":"ROUND('HVAC & Envelope'!D12,0)","v":0},{"$f":"'HVAC & Envelope'!E12","v":0},{"$f":"'HVAC & Envelope'!F12","v":0},null,null,null,{"$f":"'HVAC & Envelope'!G12","v":0},4,null,null,null,null,null,null,{"$f":"'HVAC & Envelope'!M12","v":0},null,null,null,null,null,null,null,null,null,null,{"$f":"TEXT('HVAC & Envelope'!I12,\"# ?/?\")","v":"0    "},null,null,null,null,null,null,null,null,null,null,{"$f":"'HVAC & Envelope'!J12","v":0}]
[null,null,null,null,null,null,null,null,"Entrance & Exit Door Air Infiltration",3,{"$f":"INDEX('Savings Summary'!$Q$8:$Q$51,MATCH('DSMT Export'!I98,'Savings Summary'!$C$8:$C$51,0))","v":"a1r3u000003FilMAAS"},{"$f":"INDEX('Savings Summary'!$R$8:$R$51,MATCH('DSMT Export'!I98,'Savings Summary'!$C$8:$C$51,0))","v":"0123u000000VQdKAAW"},{"$f":"APID","v":0},{"$f":"EAID","v":0},{"$f":"ROUND(IF('HVAC & Envelope'!T13,'HVAC & Envelope'!B13,0),3)","v":0},{"$f":"ROUND(IF('HVAC & Envelope'!T13,0,'HVAC & Envelope'!B13),3)","v":0},{"$f":"ROUND(MAX(O98:P98,'HVAC & Envelope'!C13),3)","v":0},{"$f":"ROUND('HVAC & Envelope'!D13,0)","v":0},{"$f":"'HVAC & Envelope'!E13","v":0},{"$f":"'HVAC & Envelope'!F13","v":0},null,null,null,{"$f":"'HVAC & Envelope'!G13","v":0},{"$f":"SelectedZone","v":4},null,null,null,null,null,null,{"$f":"'HVAC & Envelope'!M13","v":0},null,null,null,null,null,null,null,null,null,null,{"$f":"TEXT('HVAC & Envelope'!I13,\"# ?/?\")","v":"0    "},null,null,null,null,null,null,null,null,null,null,{"$f":"'HVAC & Envelope'!J13","v":0}]
[null,null,null,null,null,null,null,null,"Entrance & Exit Door Air Infiltration",4,{"$f":"INDEX('Savings Summary'!$Q$8:$Q$51,MATCH('DSMT Export'!I99,'Savings Summary'!$C$8:$C$51,0))","v":"a1r3u000003FilMAAS"},{"$f":"INDEX('Savings Summary'!$R$8:$R$51,MATCH('DSMT Export'!I99,'Savings Summary'!$C$8:$C$51,0))","v":"0123u000000VQdKAAW"},0,0,{"$f":"ROUND(IF('HVAC & Envelope'!T14,'HVAC & Envelope'!B14,0),3)","v":0},{"$f":"ROUND(IF('HVAC & Envelope'!T14,0,'HVAC & Envelope'!B14),3)","v":0},{"$f":"ROUND(MAX(O99:P99,'HVAC & Envelope'!C14),3)","v":0},{"$f":"ROUND('HVAC & Envelope'!D14,0)","v":0},{"$f":"'HVAC & Envelope'!E14","v":0},{"$f":"'HVAC & Envelope'!F14","v":0},null,null,null,{"$f":"'HVAC & Envelope'!G14","v":0},4,null,null,null,null,null,null,{"$f":"'HVAC & Envelope'!M14","v":0},null,null,null,null,null,null,null,null,null,null,{"$f":"TEXT('HVAC & Envelope'!I14,\"# ?/?\")","v":"0    "},null,null,null,null,null,null,null,null,null,null,{"$f":"'HVAC & Envelope'!J14","v":0}]
[null,null,null,null,null,null,null,null,"Window Film Treatment",1,{"$f":"INDEX('Savings Summary'!$Q$8:$Q$51,MATCH('DSMT Export'!I100,'Savings Summary'!$C$8:$C$51,0))","v":"a1r3u000003FimHAAS"},{"$f":"INDEX('Savings Summary'!$R$8:$R$51,MATCH('DSMT Export'!I100,'Savings Summary'!$C$8:$C$51,0))","v":"0123u000000VQd7AAG"},0,0,{"$f":"ROUND('HVAC & Envelope'!B18,3)","v":0},{"$f":"0","v":0},{"$f":"ROUND(MAX(O100:P100,'HVAC & Envelope'!C18),3)","v":0},{"$f":"ROUND('HVAC & Envelope'!D18,0)","v":0},{"$f":"'HVAC & Envelope'!E18","v":0},null,null,{"$f":"'HVAC & Envelope'!G18","v":0},null,{"$f":"'HVAC & Envelope'!H18","v":0},4,null,null,{"$f":"'HVAC & Envelope'!F18","v":0},null,null,null,null,null,null,null,null,null,null,null,null,null,null,null,null,null,null,null,null,null,null,null,null,null,null,{"$f":"'HVAC & Envelope'!J18","v":0},null,{"$f":"'HVAC & Envelope'!I18","v":0},null,null,null,null,null,null,null,null,null,null,null,null,null,null,null,null,null,null,{"$f":"'HVAC & Envelope'!S18","v":{"$error":"#N/A"}}]
[null,null,null,null,null,null,null,null,"Window Film Treatment",2,{"$f":"INDEX('Savings Summary'!$Q$8:$Q$51,MATCH('DSMT Export'!I101,'Savings Summary'!$C$8:$C$51,0))","v":"a1r3u000003FimHAAS"},{"$f":"INDEX('Savings Summary'!$R$8:$R$51,MATCH('DSMT Export'!I101,'Savings Summary'!$C$8:$C$51,0))","v":"0123u000000VQd7AAG"},0,0,{"$f":"ROUND('HVAC & Envelope'!B19,3)","v":0},{"$f":"0","v":0},{"$f":"ROUND(MAX(O101:P101,'HVAC & Envelope'!C19),3)","v":0},{"$f":"ROUND('HVAC & Envelope'!D19,0)","v":0},{"$f":"'HVAC & Envelope'!E19","v":0},null,null,{"$f":"'HVAC & Envelope'!G19","v":0},null,{"$f":"'HVAC & Envelope'!H19","v":0},4,null,null,{"$f":"'HVAC & Envelope'!F19","v":0},null,null,null,null,null,null,null,null,null,null,null,null,null,null,null,null,null,null,null,null,null,null,null,null,null,null,{"$f":"'HVAC & Envelope'!J19","v":0},null,{"$f":"'HVAC & Envelope'!I19","v":0},null,null,null,null,null,null,null,null,null,null,null,null,null,null,null,null,null,null,{"$f":"'HVAC & Envelope'!S19","v":{"$error":"#N/A"}}]
[null,null,null,null,null,null,null,null,"Window Film Treatment",3,{"$f":"INDEX('Savings Summary'!$Q$8:$Q$51,MATCH('DSMT Export'!I102,'Savings Summary'!$C$8:$C$51,0))","v":"a1r3u000003FimHAAS"},{"$f":"INDEX('Savings Summary'!$R$8:$R$51,MATCH('DSMT Export'!I102,'Savings Summary'!$C$8:$C$51,0))","v":"0123u000000VQd7AAG"},0,0,{"$f":"ROUND('HVAC & Envelope'!B20,3)","v":0},{"$f":"0","v":0},{"$f":"ROUND(MAX(O102:P102,'HVAC & Envelope'!C20),3)","v":0},{"$f":"ROUND('HVAC & Envelope'!D20,0)","v":0},{"$f":"'HVAC & Envelope'!E20","v":0},null,null,{"$f":"'HVAC & Envelope'!G20","v":0},null,{"$f":"'HVAC & Envelope'!H20","v":0},4,null,null,{"$f":"'HVAC & Envelope'!F20","v":0},null,null,null,null,null,null,null,null,null,null,null,null,null,null,null,null,null,null,null,null,null,null,null,null,null,null,{"$f":"'HVAC & Envelope'!J20","v":0},null,{"$f":"'HVAC & Envelope'!I20","v":0},null,null,null,null,null,null,null,null,null,null,null,null,null,null,null,null,null,null,{"$f":"'HVAC & Envelope'!S20","v":{"$error":"#N/A"}}]
[null,null,null,null,null,null,null,null,"Window Film Treatment",4,{"$f":"INDEX('Savings Summary'!$Q$8:$Q$51,MATCH('DSMT Export'!I103,'Savings Summary'!$C$8:$C$51,0))","v":"a1r3u000003FimHAAS"},{"$f":"INDEX('Savings Summary'!$R$8:$R$51,MATCH('DSMT Export'!I103,'Savings Summary'!$C$8:$C$51,0))","v":"0123u000000VQd7AAG"},0,0,{"$f":"ROUND('HVAC & Envelope'!B21,3)","v":0},{"$f":"0","v":0},{"$f":"ROUND(MAX(O103:P103,'HVAC & Envelope'!C21),3)","v":0},{"$f":"ROUND('HVAC & Envelope'!D21,0)","v":0},{"$f":"'HVAC & Envelope'!E21","v":0},null,null,{"$f":"'HVAC & Envelope'!G21","v":0},null,{"$f":"'HVAC & Envelope'!H21","v":0},4,null,null,{"$f":"'HVAC & Envelope'!F21","v":0},null,null,null,null,null,null,null,null,null,null,null,null,null,null,null,null,null,null,null,null,null,null,null,null,null,null,{"$f":"'HVAC & Envelope'!J21","v":0},null,{"$f":"'HVAC & Envelope'!I21","v":0},null,null,null,null,null,null,null,null,null,null,null,null,null,null,null,null,null,null,{"$f":"'HVAC & Envelope'!S21","v":{"$error":"#N/A"}}]
[null,null,null,null,null,null,null,null,"Window Film Treatment",5,{"$f":"INDEX('Savings Summary'!$Q$8:$Q$51,MATCH('DSMT Export'!I104,'Savings Summary'!$C$8:$C$51,0))","v":"a1r3u000003FimHAAS"},{"$f":"INDEX('Savings Summary'!$R$8:$R$51,MATCH('DSMT Export'!I104,'Savings Summary'!$C$8:$C$51,0))","v":"0123u000000VQd7AAG"},0,0,{"$f":"ROUND('HVAC & Envelope'!B22,3)","v":0},{"$f":"0","v":0},{"$f":"ROUND(MAX(O104:P104,'HVAC & Envelope'!C22),3)","v":0},{"$f":"ROUND('HVAC & Envelope'!D22,0)","v":0},{"$f":"'HVAC & Envelope'!E22","v":0},null,null,{"$f":"'HVAC & Envelope'!G22","v":0},null,{"$f":"'HVAC & Envelope'!H22","v":0},4,null,null,{"$f":"'HVAC & Envelope'!F22","v":0},null,null,null,null,null,null,null,null,null,null,null,null,null,null,null,null,null,null,null,null,null,null,null,null,null,null,{"$f":"'HVAC & Envelope'!J22","v":0},null,{"$f":"'HVAC & Envelope'!I22","v":0},null,null,null,null,null,null,null,null,null,null,null,null,null,null,null,null,null,null,{"$f":"'HVAC & Envelope'!S22","v":{"$error":"#N/A"}}]
[null,null,null,null,null,null,null,null,"HVAC Variable Frequency Drives (VFD's)",1,{"$f":"INDEX('Savings Summary'!$Q$8:$Q$51,MATCH('DSMT Export'!I105,'Savings Summary'!$C$8:$C$51,0))","v":"a1r3u000003FilaAAC"},{"$f":"INDEX('Savings Summary'!$R$8:$R$51,MATCH('DSMT Export'!I105,'Savings Summary'!$C$8:$C$51,0))","v":"0123u000000VQd1AAG"},0,0,{"$f":"IF('HVAC & Envelope'!N26>='HVAC & Envelope'!O26,ROUND('HVAC & Envelope'!B26,3),0)","v":0},{"$f":"IF('HVAC & Envelope'!N26<'HVAC & Envelope'!O26,ROUND('HVAC & Envelope'!B26,3),0)","v":0},{"$f":"ROUND(MAX(O105:P105,'HVAC & Envelope'!C26),3)","v":0},{"$f":"ROUND('HVAC & Envelope'!D26,0)","v":0},{"$f":"'HVAC & Envelope'!E26","v":0},{"$f":"'HVAC & Envelope'!F26","v":0},null,{"$f":"'HVAC & Envelope'!G26","v":0},null,null,4,{"$f":"'HVAC & Envelope'!H26","v":0},null,null,null,null,null,null,null,null,null,null,null,null,null,null,null,null,null,null,null,null,null,null,null,null,null,null,null,null,null,null,null,null,null,null,null,{"$f":"'HVAC & Envelope'!J26","v":0},null,null,null,{"$f":"IF('HVAC & Envelope'!K26=\"\",\"\",'HVAC & Envelope'!K26)","v":""}]
[null,null,null,null,null,null,null,null,"HVAC Variable Frequency Drives (VFD's)",2,{"$f":"INDEX('Savings Summary'!$Q$8:$Q$51,MATCH('DSMT Export'!I106,'Savings Summary'!$C$8:$C$51,0))","v":"a1r3u000003FilaAAC"},{"$f":"INDEX('Savings Summary'!$R$8:$R$51,MATCH('DSMT Export'!I106,'Savings Summary'!$C$8:$C$51,0))","v":"0123u000000VQd1AAG"},0,0,{"$f":"IF('HVAC & Envelope'!N27>='HVAC & Envelope'!O27,ROUND('HVAC & Envelope'!B27,3),0)","v":0},{"$f":"IF('HVAC & Envelope'!N27<'HVAC & Envelope'!O27,ROUND('HVAC & Envelope'!B27,3),0)","v":0},{"$f":"ROUND(MAX(O106:P106,'HVAC & Envelope'!C27),3)","v":0},{"$f":"ROUND('HVAC & Envelope'!D27,0)","v":0},{"$f":"'HVAC & Envelope'!E27","v":0},{"$f":"'HVAC & Envelope'!F27","v":0},null,{"$f":"'HVAC & Envelope'!G27","v":0},null,null,4,{"$f":"'HVAC & Envelope'!H27","v":0},null,null,null,null,null,null,null,null,null,null,null,null,null,null,null,null,null,null,null,null,null,null,null,null,null,null,null,null,null,null,null,null,null,null,null,{"$f":"'HVAC & Envelope'!J27","v":0},null,null,null,{"$f":"IF('HVAC & Envelope'!K27=\"\",\"\",'HVAC & Envelope'!K27)","v":""}]
[null,null,null,null,null,null,null,null,"HVAC Variable Frequency Drives (VFD's)",3,{"$f":"INDEX('Savings Summary'!$Q$8:$Q$51,MATCH('DSMT Export'!I107,'Savings Summary'!$C$8:$C$51,0))","v":"a1r3u000003FilaAAC"},{"$f":"INDEX('Savings Summary'!$R$8:$R$51,MATCH('DSMT Export'!I107,'Savings Summary'!$C$8:$C$51,0))","v":"0123u000000VQd1AAG"},0,0,{"$f":"IF('HVAC & Envelope'!N28>='HVAC & Envelope'!O28,ROUND('HVAC & Envelope'!B28,3),0)","v":0},{"$f":"IF('HVAC & Envelope'!N28<'HVAC & Envelope'!O28,ROUND('HVAC & Envelope'!B28,3),0)","v":0},{"$f":"ROUND(MAX(O107:P107,'HVAC & Envelope'!C28),3)","v":0},{"$f":"ROUND('HVAC & Envelope'!D28,0)","v":0},{"$f":"'HVAC & Envelope'!E28","v":0},{"$f":"'HVAC & Envelope'!F28","v":0},null,{"$f":"'HVAC & Envelope'!G28","v":0},null,null,4,{"$f":"'HVAC & Envelope'!H28","v":0},null,null,null,null,null,null,null,null,null,null,null,null,null,null,null,null,null,null,null,null,null,null,null,null,null,null,null,null,null,null,null,null,null,null,null,{"$f":"'HVAC & Envelope'!J28","v":0},null,null,null,{"$f":"IF('HVAC & Envelope'!K28=\"\",\"\",'HVAC & Envelope'!K28)","v":""}]
[null,null,null,null,null,null,null,null,"HVAC Variable Frequency Drives (VFD's)",4,{"$f":"INDEX('Savings Summary'!$Q$8:$Q$51,MATCH('DSMT Export'!I108,'Savings Summary'!$C$8:$C$51,0))","v":"a1r3u000003FilaAAC"},{"$f":"INDEX('Savings Summary'!$R$8:$R$51,MATCH('DSMT Export'!I108,'Savings Summary'!$C$8:$C$51,0))","v":"0123u000000VQd1AAG"},0,0,{"$f":"IF('HVAC & Envelope'!N29>='HVAC & Envelope'!O29,ROUND('HVAC & Envelope'!B29,3),0)","v":0},{"$f":"IF('HVAC & Envelope'!N29<'HVAC & Envelope'!O29,ROUND('HVAC & Envelope'!B29,3),0)","v":0},{"$f":"ROUND(MAX(O108:P108,'HVAC & Envelope'!C29),3)","v":0},{"$f":"ROUND('HVAC & Envelope'!D29,0)","v":0},{"$f":"'HVAC & Envelope'!E29","v":0},{"$f":"'HVAC & Envelope'!F29","v":0},null,{"$f":"'HVAC & Envelope'!G29","v":0},null,null,4,{"$f":"'HVAC & Envelope'!H29","v":0},null,null,null,null,null,null,null,null,null,null,null,null,null,null,null,null,null,null,null,null,null,null,null,null,null,null,null,null,null,null,null,null,null,null,null,{"$f":"'HVAC & Envelope'!J29","v":0},null,null,null,{"$f":"IF('HVAC & Envelope'!K29=\"\",\"\",'HVAC & Envelope'!K29)","v":""}]
[null,null,null,null,null,null,null,null,"HVAC Variable Frequency Drives (VFD's)",5,{"$f":"INDEX('Savings Summary'!$Q$8:$Q$51,MATCH('DSMT Export'!I109,'Savings Summary'!$C$8:$C$51,0))","v":"a1r3u000003FilaAAC"},{"$f":"INDEX('Savings Summary'!$R$8:$R$51,MATCH('DSMT Export'!I109,'Savings Summary'!$C$8:$C$51,0))","v":"0123u000000VQd1AAG"},0,0,{"$f":"IF('HVAC & Envelope'!N30>='HVAC & Envelope'!O30,ROUND('HVAC & Envelope'!B30,3),0)","v":0},{"$f":"IF('HVAC & Envelope'!N30<'HVAC & Envelope'!O30,ROUND('HVAC & Envelope'!B30,3),0)","v":0},{"$f":"ROUND(MAX(O109:P109,'HVAC & Envelope'!C30),3)","v":0},{"$f":"ROUND('HVAC & Envelope'!D30,0)","v":0},{"$f":"'HVAC & Envelope'!E30","v":0},{"$f":"'HVAC & Envelope'!F30","v":0},null,{"$f":"'HVAC & Envelope'!G30","v":0},null,null,4,{"$f":"'HVAC & Envelope'!H30","v":0},null,null,null,null,null,null,null,null,null,null,null,null,null,null,null,null,null,null,null,null,null,null,null,null,null,null,null,null,null,null,null,null,null,null,null,{"$f":"'HVAC & Envelope'!J30","v":0},null,null,null,{"$f":"IF('HVAC & Envelope'!K30=\"\",\"\",'HVAC & Envelope'!K30)","v":""}]
[null,null,null,null,null,null,null,null,"HVAC Variable Frequency Drives (VFD's)",6,{"$f":"INDEX('Savings Summary'!$Q$8:$Q$51,MATCH('DSMT Export'!I110,'Savings Summary'!$C$8:$C$51,0))","v":"a1r3u000003FilaAAC"},{"$f":"INDEX('Savings Summary'!$R$8:$R$51,MATCH('DSMT Export'!I110,'Savings Summary'!$C$8:$C$51,0))","v":"0123u000000VQd1AAG"},0,0,{"$f":"IF('HVAC & Envelope'!N31>='HVAC & Envelope'!O31,ROUND('HVAC & Envelope'!B31,3),0)","v":0},{"$f":"IF('HVAC & Envelope'!N31<'HVAC & Envelope'!O31,ROUND('HVAC & Envelope'!B31,3),0)","v":0},{"$f":"ROUND(MAX(O110:P110,'HVAC & Envelope'!C31),3)","v":0},{"$f":"ROUND('HVAC & Envelope'!D31,0)","v":0},{"$f":"'HVAC & Envelope'!E31","v":0},{"$f":"'HVAC & Envelope'!F31","v":0},null,{"$f":"'HVAC & Envelope'!G31","v":0},null,null,4,{"$f":"'HVAC & Envelope'!H31","v":0},null,null,null,null,null,null,null,null,null,null,null,null,null,null,null,null,null,null,null,null,null,null,null,null,null,null,null,null,null,null,null,null,null,null,null,{"$f":"'HVAC & Envelope'!J31","v":0},null,null,null,{"$f":"IF('HVAC & Envelope'!K31=\"\",\"\",'HVAC & Envelope'!K31)","v":""}]
[null,null,null,null,null,null,null,null,"HVAC Variable Frequency Drives (VFD's)",7,{"$f":"INDEX('Savings Summary'!$Q$8:$Q$51,MATCH('DSMT Export'!I111,'Savings Summary'!$C$8:$C$51,0))","v":"a1r3u000003FilaAAC"},{"$f":"INDEX('Savings Summary'!$R$8:$R$51,MATCH('DSMT Export'!I111,'Savings Summary'!$C$8:$C$51,0))","v":"0123u000000VQd1AAG"},0,0,{"$f":"IF('HVAC & Envelope'!N32>='HVAC & Envelope'!O32,ROUND('HVAC & Envelope'!B32,3),0)","v":0},{"$f":"IF('HVAC & Envelope'!N32<'HVAC & Envelope'!O32,ROUND('HVAC & Envelope'!B32,3),0)","v":0},{"$f":"ROUND(MAX(O111:P111,'HVAC & Envelope'!C32),3)","v":0},{"$f":"ROUND('HVAC & Envelope'!D32,0)","v":0},{"$f":"'HVAC & Envelope'!E32","v":0},{"$f":"'HVAC & Envelope'!F32","v":0},null,{"$f":"'HVAC & Envelope'!G32","v":0},null,null,4,{"$f":"'HVAC & Envelope'!H32","v":0},null,null,null,null,null,null,null,null,null,null,null,null,null,null,null,null,null,null,null,null,null,null,null,null,null,null,null,null,null,null,null,null,null,null,null,{"$f":"'HVAC & Envelope'!J32","v":0},null,null,null,{"$f":"IF('HVAC & Envelope'!K32=\"\",\"\",'HVAC & Envelope'!K32)","v":""}]
[null,null,null,null,null,null,null,null,"HVAC Variable Frequency Drives (VFD's)",8,{"$f":"INDEX('Savings Summary'!$Q$8:$Q$51,MATCH('DSMT Export'!I112,'Savings Summary'!$C$8:$C$51,0))","v":"a1r3u000003FilaAAC"},{"$f":"INDEX('Savings Summary'!$R$8:$R$51,MATCH('DSMT Export'!I112,'Savings Summary'!$C$8:$C$51,0))","v":"0123u000000VQd1AAG"},0,0,{"$f":"IF('HVAC & Envelope'!N33>='HVAC & Envelope'!O33,ROUND('HVAC & Envelope'!B33,3),0)","v":0},{"$f":"IF('HVAC & Envelope'!N33<'HVAC & Envelope'!O33,ROUND('HVAC & Envelope'!B33,3),0)","v":0},{"$f":"ROUND(MAX(O112:P112,'HVAC & Envelope'!C33),3)","v":0},{"$f":"ROUND('HVAC & Envelope'!D33,0)","v":0},{"$f":"'HVAC & Envelope'!E33","v":0},{"$f":"'HVAC & Envelope'!F33","v":0},null,{"$f":"'HVAC & Envelope'!G33","v":0},null,null,4,{"$f":"'HVAC & Envelope'!H33","v":0},null,null,null,null,null,null,null,null,null,null,null,null,null,null,null,null,null,null,null,null,null,null,null,null,null,null,null,null,null,null,null,null,null,null,null,{"$f":"'HVAC & Envelope'!J33","v":0},null,null,null,{"$f":"IF('HVAC & Envelope'!K33=\"\",\"\",'HVAC & Envelope'!K33)","v":""}]
[null,null,null,null,null,null,null,null,"HVAC Variable Frequency Drives (VFD's)",9,{"$f":"INDEX('Savings Summary'!$Q$8:$Q$51,MATCH('DSMT Export'!I113,'Savings Summary'!$C$8:$C$51,0))","v":"a1r3u000003FilaAAC"},{"$f":"INDEX('Savings Summary'!$R$8:$R$51,MATCH('DSMT Export'!I113,'Savings Summary'!$C$8:$C$51,0))","v":"0123u000000VQd1AAG"},0,0,{"$f":"IF('HVAC & Envelope'!N34>='HVAC & Envelope'!O34,ROUND('HVAC & Envelope'!B34,3),0)","v":0},{"$f":"IF('HVAC & Envelope'!N34<'HVAC & Envelope'!O34,ROUND('HVAC & Envelope'!B34,3),0)","v":0},{"$f":"ROUND(MAX(O113:P113,'HVAC & Envelope'!C34),3)","v":0},{"$f":"ROUND('HVAC & Envelope'!D34,0)","v":0},{"$f":"'HVAC & Envelope'!E34","v":0},{"$f":"'HVAC & Envelope'!F34","v":0},null,{"$f":"'HVAC & Envelope'!G34","v":0},null,null,4,{"$f":"'HVAC & Envelope'!H34","v":0},null,null,null,null,null,null,null,null,null,null,null,null,null,null,null,null,null,null,null,null,null,null,null,null,null,null,null,null,null,null,null,null,null,null,null,{"$f":"'HVAC & Envelope'!J34","v":0},null,null,null,{"$f":"IF('HVAC & Envelope'!K34=\"\",\"\",'HVAC & Envelope'!K34)","v":""}]
[null,null,null,null,null,null,null,null,"HVAC Variable Frequency Drives (VFD's)",10,{"$f":"INDEX('Savings Summary'!$Q$8:$Q$51,MATCH('DSMT Export'!I114,'Savings Summary'!$C$8:$C$51,0))","v":"a1r3u000003FilaAAC"},{"$f":"INDEX('Savings Summary'!$R$8:$R$51,MATCH('DSMT Export'!I114,'Savings Summary'!$C$8:$C$51,0))","v":"0123u000000VQd1AAG"},0,0,{"$f":"IF('HVAC & Envelope'!N35>='HVAC & Envelope'!O35,ROUND('HVAC & Envelope'!B35,3),0)","v":0},{"$f":"IF('HVAC & Envelope'!N35<'HVAC & Envelope'!O35,ROUND('HVAC & Envelope'!B35,3),0)","v":0},{"$f":"ROUND(MAX(O114:P114,'HVAC & Envelope'!C35),3)","v":0},{"$f":"ROUND('HVAC & Envelope'!D35,0)","v":0},{"$f":"'HVAC & Envelope'!E35","v":0},{"$f":"'HVAC & Envelope'!F35","v":0},null,{"$f":"'HVAC & Envelope'!G35","v":0},null,null,4,{"$f":"'HVAC & Envelope'!H35","v":0},null,null,null,null,null,null,null,null,null,null,null,null,null,null,null,null,null,null,null,null,null,null,null,null,null,null,null,null,null,null,null,null,null,null,null,{"$f":"'HVAC & Envelope'!J35","v":0},null,null,null,{"$f":"IF('HVAC & Envelope'!K35=\"\",\"\",'HVAC & Envelope'!K35)","v":""}]
[null,null,null,null,null,null,null,null,"Condenser Air Evaporative Pre-Cooling",1,{"$f":"INDEX('Savings Summary'!$Q$8:$Q$51,MATCH('DSMT Export'!I115,'Savings Summary'!$C$8:$C$51,0))","v":"a1r3u000003Fil2AAC"},{"$f":"INDEX('Savings Summary'!$R$8:$R$51,MATCH('DSMT Export'!I115,'Savings Summary'!$C$8:$C$51,0))","v":"0123u000000VQd0AAG"},0,0,{"$f":"ROUND('HVAC & Envelope'!B39,3)","v":0},{"$f":"0","v":0},{"$f":"ROUND(MAX(O115:P115,'HVAC & Envelope'!C39),3)","v":0},{"$f":"ROUND('HVAC & Envelope'!D39,0)","v":0},{"$f":"'HVAC & Envelope'!E39","v":0},{"$f":"'HVAC & Envelope'!F39","v":0},null,null,null,null,4,{"$f":"'HVAC & Envelope'!G39","v":0},null,null,null,null,null,null,null,null,null,null,null,null,null,null,null,null,null,null,null,null,null,null,null,null,null,null,{"$f":"'HVAC & Envelope'!H39","v":0},null,null,null,null,null,null,null,null,null,null,null,null,null,null,{"$f":"IF(RIGHT(BA115,7)=\"Chiller\",'HVAC & Envelope'!O39,\"\")","v":""},{"$f":"IF(RIGHT(BA115,7)=\"Chiller\",\"\",'HVAC & Envelope'!O39*12000)","v":0},{"$f":"IF(RIGHT(BA115,7)=\"Chiller\",'HVAC & Envelope'!P39,\"\")","v":""},{"$f":"IF(RIGHT(BA115,7)=\"Chiller\",'HVAC & Envelope'!Q39,\"\")","v":""},{"$f":"IF(RIGHT(BA115,7)=\"Chiller\",\"\",12/'HVAC & Envelope'!P39)","v":{"$error":"#DIV/0!"}},{"$f":"IF(RIGHT(BA115,7)=\"Chiller\",\"\",IF(BQ115<=60000,12/'HVAC & Envelope'!Q39,0))","v":{"$error":"#DIV/0!"}},{"$f":"IF(RIGHT(BA115,7)=\"Chiller\",\"\",IF(BQ115>60000,12/'HVAC & Envelope'!Q39,0))","v":0}]
[null,null,null,null,null,null,null,null,"Condenser Air Evaporative Pre-Cooling",2,{"$f":"INDEX('Savings Summary'!$Q$8:$Q$51,MATCH('DSMT Export'!I116,'Savings Summary'!$C$8:$C$51,0))","v":"a1r3u000003Fil2AAC"},{"$f":"INDEX('Savings Summary'!$R$8:$R$51,MATCH('DSMT Export'!I116,'Savings Summary'!$C$8:$C$51,0))","v":"0123u000000VQd0AAG"},0,0,{"$f":"ROUND('HVAC & Envelope'!B40,3)","v":0},{"$f":"0","v":0},{"$f":"ROUND(MAX(O116:P116,'HVAC & Envelope'!C40),3)","v":0},{"$f":"ROUND('HVAC & Envelope'!D40,0)","v":0},{"$f":"'HVAC & Envelope'!E40","v":0},{"$f":"'HVAC & Envelope'!F40","v":0},null,null,null,null,4,{"$f":"'HVAC & Envelope'!G40","v":0},null,null,null,null,null,null,null,null,null,null,null,null,null,null,null,null,null,null,null,null,null,null,null,null,null,null,{"$f":"'HVAC & Envelope'!H40","v":0},null,null,null,null,null,null,null,null,null,null,null,null,null,null,{"$f":"IF(RIGHT(BA116,7)=\"Chiller\",'HVAC & Envelope'!O40,\"\")","v":""},{"$f":"IF(RIGHT(BA116,7)=\"Chiller\",\"\",'HVAC & Envelope'!O40*12000)","v":0},{"$f":"IF(RIGHT(BA116,7)=\"Chiller\",'HVAC & Envelope'!P40,\"\")","v":""},{"$f":"IF(RIGHT(BA116,7)=\"Chiller\",'HVAC & Envelope'!Q40,\"\")","v":""},{"$f":"IF(RIGHT(BA116,7)=\"Chiller\",\"\",12/'HVAC & Envelope'!P40)","v":{"$error":"#DIV/0!"}},{"$f":"IF(RIGHT(BA116,7)=\"Chiller\",\"\",IF(BQ116<=60000,12/'HVAC & Envelope'!Q40,\"\"))","v":{"$error":"#DIV/0!"}},{"$f":"IF(RIGHT(BA116,7)=\"Chiller\",\"\",IF(BQ116>60000,12/'HVAC & Envelope'!Q40,\"\"))","v":""}]
[null,null,null,null,null,null,null,null,"Condenser Air Evaporative Pre-Cooling",3,{"$f":"INDEX('Savings Summary'!$Q$8:$Q$51,MATCH('DSMT Export'!I117,'Savings Summary'!$C$8:$C$51,0))","v":"a1r3u000003Fil2AAC"},{"$f":"INDEX('Savings Summary'!$R$8:$R$51,MATCH('DSMT Export'!I117,'Savings Summary'!$C$8:$C$51,0))","v":"0123u000000VQd0AAG"},0,0,{"$f":"ROUND('HVAC & Envelope'!B41,3)","v":0},{"$f":"0","v":0},{"$f":"ROUND(MAX(O117:P117,'HVAC & Envelope'!C41),3)","v":0},{"$f":"ROUND('HVAC & Envelope'!D41,0)","v":0},{"$f":"'HVAC & Envelope'!E41","v":0},{"$f":"'HVAC & Envelope'!F41","v":0},null,null,null,null,4,{"$f":"'HVAC & Envelope'!G41","v":0},null,null,null,null,null,null,null,null,null,null,null,null,null,null,null,null,null,null,null,null,null,null,null,null,null,null,{"$f":"'HVAC & Envelope'!H41","v":0},null,null,null,null,null,null,null,null,null,null,null,null,null,null,{"$f":"IF(RIGHT(BA117,7)=\"Chiller\",'HVAC & Envelope'!O41,\"\")","v":""},{"$f":"IF(RIGHT(BA117,7)=\"Chiller\",\"\",'HVAC & Envelope'!O41*12000)","v":0},{"$f":"IF(RIGHT(BA117,7)=\"Chiller\",'HVAC & Envelope'!P41,\"\")","v":""},{"$f":"IF(RIGHT(BA117,7)=\"Chiller\",'HVAC & Envelope'!Q41,\"\")","v":""},{"$f":"IF(RIGHT(BA117,7)=\"Chiller\",\"\",12/'HVAC & Envelope'!P41)","v":{"$error":"#DIV/0!"}},{"$f":"IF(RIGHT(BA117,7)=\"Chiller\",\"\",IF(BQ117<=60000,12/'HVAC & Envelope'!Q41,\"\"))","v":{"$error":"#DIV/0!"}},{"$f":"IF(RIGHT(BA117,7)=\"Chiller\",\"\",IF(BQ117>60000,12/'HVAC & Envelope'!Q41,\"\"))","v":""}]
[null,null,null,null,null,null,null,null,"Condenser Air Evaporative Pre-Cooling",4,{"$f":"INDEX('Savings Summary'!$Q$8:$Q$51,MATCH('DSMT Export'!I118,'Savings Summary'!$C$8:$C$51,0))","v":"a1r3u000003Fil2AAC"},{"$f":"INDEX('Savings Summary'!$R$8:$R$51,MATCH('DSMT Export'!I118,'Savings Summary'!$C$8:$C$51,0))","v":"0123u000000VQd0AAG"},0,0,{"$f":"ROUND('HVAC & Envelope'!B42,3)","v":0},{"$f":"0","v":0},{"$f":"ROUND(MAX(O118:P118,'HVAC & Envelope'!C42),3)","v":0},{"$f":"ROUND('HVAC & Envelope'!D42,0)","v":0},{"$f":"'HVAC & Envelope'!E42","v":0},{"$f":"'HVAC & Envelope'!F42","v":0},null,null,null,null,4,{"$f":"'HVAC & Envelope'!G42","v":0},null,null,null,null,null,null,null,null,null,null,null,null,null,null,null,null,null,null,null,null,null,null,null,null,null,null,{"$f":"'HVAC & Envelope'!H42","v":0},null,null,null,null,null,null,null,null,null,null,null,null,null,null,{"$f":"IF(RIGHT(BA118,7)=\"Chiller\",'HVAC & Envelope'!O42,\"\")","v":""},{"$f":"IF(RIGHT(BA118,7)=\"Chiller\",\"\",'HVAC & Envelope'!O42*12000)","v":0},{"$f":"IF(RIGHT(BA118,7)=\"Chiller\",'HVAC & Envelope'!P42,\"\")","v":""},{"$f":"IF(RIGHT(BA118,7)=\"Chiller\",'HVAC & Envelope'!Q42,\"\")","v":""},{"$f":"IF(RIGHT(BA118,7)=\"Chiller\",\"\",12/'HVAC & Envelope'!P42)","v":{"$error":"#DIV/0!"}},{"$f":"IF(RIGHT(BA118,7)=\"Chiller\",\"\",IF(BQ118<=60000,12/'HVAC & Envelope'!Q42,\"\"))","v":{"$error":"#DIV/0!"}},{"$f":"IF(RIGHT(BA118,7)=\"Chiller\",\"\",IF(BQ118>60000,12/'HVAC & Envelope'!Q42,\"\"))","v":""}]
[null,null,null,null,null,null,null,null,"Condenser Air Evaporative Pre-Cooling",5,{"$f":"INDEX('Savings Summary'!$Q$8:$Q$51,MATCH('DSMT Export'!I119,'Savings Summary'!$C$8:$C$51,0))","v":"a1r3u000003Fil2AAC"},{"$f":"INDEX('Savings Summary'!$R$8:$R$51,MATCH('DSMT Export'!I119,'Savings Summary'!$C$8:$C$51,0))","v":"0123u000000VQd0AAG"},0,0,{"$f":"ROUND('HVAC & Envelope'!B43,3)","v":0},{"$f":"0","v":0},{"$f":"ROUND(MAX(O119:P119,'HVAC & Envelope'!C43),3)","v":0},{"$f":"ROUND('HVAC & Envelope'!D43,0)","v":0},{"$f":"'HVAC & Envelope'!E43","v":0},{"$f":"'HVAC & Envelope'!F43","v":0},null,null,null,null,4,{"$f":"'HVAC & Envelope'!G43","v":0},null,null,null,null,null,null,null,null,null,null,null,null,null,null,null,null,null,null,null,null,null,null,null,null,null,null,{"$f":"'HVAC & Envelope'!H43","v":0},null,null,null,null,null,null,null,null,null,null,null,null,null,null,{"$f":"IF(RIGHT(BA119,7)=\"Chiller\",'HVAC & Envelope'!O43,\"\")","v":""},{"$f":"IF(RIGHT(BA119,7)=\"Chiller\",\"\",'HVAC & Envelope'!O43*12000)","v":0},{"$f":"IF(RIGHT(BA119,7)=\"Chiller\",'HVAC & Envelope'!P43,\"\")","v":""},{"$f":"IF(RIGHT(BA119,7)=\"Chiller\",'HVAC & Envelope'!Q43,\"\")","v":""},{"$f":"IF(RIGHT(BA119,7)=\"Chiller\",\"\",12/'HVAC & Envelope'!P43)","v":{"$error":"#DIV/0!"}},{"$f":"IF(RIGHT(BA119,7)=\"Chiller\",\"\",IF(BQ119<=60000,12/'HVAC & Envelope'!Q43,\"\"))","v":{"$error":"#DIV/0!"}},{"$f":"IF(RIGHT(BA119,7)=\"Chiller\",\"\",IF(BQ119>60000,12/'HVAC & Envelope'!Q43,\"\"))","v":""}]
[null,null,null,null,null,null,null,null,"Lodging Occupancy Controls",1,{"$f":"INDEX('Savings Summary'!$Q$8:$Q$51,MATCH('DSMT Export'!I120,'Savings Summary'!$C$8:$C$51,0))","v":"a1r3u000003FilhAAC"},{"$f":"INDEX('Savings Summary'!$R$8:$R$51,MATCH('DSMT Export'!I120,'Savings Summary'!$C$8:$C$51,0))","v":"0123u000000VQdQAAW"},0,0,{"$f":"ROUND('HVAC & Envelope'!B47,3)","v":0},{"$f":"0","v":0},{"$f":"ROUND(MAX(O120:P120,'HVAC & Envelope'!C47),3)","v":0},{"$f":"ROUND('HVAC & Envelope'!D47,0)","v":0},{"$f":"'HVAC & Envelope'!E47","v":0},{"$f":"'HVAC & Envelope'!F47","v":0},null,null,null,{"$f":"'HVAC & Envelope'!H47","v":0},4,{"$f":"'HVAC & Envelope'!G47","v":0},null,null,null,null,null,null,null,null,null,null,null,null,null,null,null,null,null,null,null,null,null,null,null,null,null,null,null,{"$f":"'HVAC & Envelope'!I47","v":0},null,null,null,null,null,null,null,null,null,null,null,null,null,null,null,null,null,null,null,null,null,null,{"$f":"T120","v":0},{"$f":"'HVAC & Envelope'!J47","v":0}]
[null,null,null,null,null,null,null,null,"Lodging Occupancy Controls",2,{"$f":"INDEX('Savings Summary'!$Q$8:$Q$51,MATCH('DSMT Export'!I121,'Savings Summary'!$C$8:$C$51,0))","v":"a1r3u000003FilhAAC"},{"$f":"INDEX('Savings Summary'!$R$8:$R$51,MATCH('DSMT Export'!I121,'Savings Summary'!$C$8:$C$51,0))","v":"0123u000000VQdQAAW"},0,0,{"$f":"ROUND('HVAC & Envelope'!B48,3)","v":0},{"$f":"0","v":0},{"$f":"ROUND(MAX(O121:P121,'HVAC & Envelope'!C48),3)","v":0},{"$f":"ROUND('HVAC & Envelope'!D48,0)","v":0},{"$f":"'HVAC & Envelope'!E48","v":0},{"$f":"'HVAC & Envelope'!F48","v":0},null,null,null,{"$f":"'HVAC & Envelope'!H48","v":0},4,{"$f":"'HVAC & Envelope'!G48","v":0},null,null,null,null,null,null,null,null,null,null,null,null,null,null,null,null,null,null,null,null,null,null,null,null,null,null,null,{"$f":"'HVAC & Envelope'!I48","v":0},null,null,null,null,null,null,null,null,null,null,null,null,null,null,null,null,null,null,null,null,null,null,{"$f":"T121","v":0},{"$f":"'HVAC & Envelope'!J48","v":0}]
[null,null,null,null,null,null,null,null,"Lodging Occupancy Controls",3,{"$f":"INDEX('Savings Summary'!$Q$8:$Q$51,MATCH('DSMT Export'!I122,'Savings Summary'!$C$8:$C$51,0))","v":"a1r3u000003FilhAAC"},{"$f":"INDEX('Savings Summary'!$R$8:$R$51,MATCH('DSMT Export'!I122,'Savings Summary'!$C$8:$C$51,0))","v":"0123u000000VQdQAAW"},0,0,{"$f":"ROUND('HVAC & Envelope'!B49,3)","v":0},{"$f":"0","v":0},{"$f":"ROUND(MAX(O122:P122,'HVAC & Envelope'!C49),3)","v":0},{"$f":"ROUND('HVAC & Envelope'!D49,0)","v":0},{"$f":"'HVAC & Envelope'!E49","v":0},{"$f":"'HVAC & Envelope'!F49","v":0},null,null,null,{"$f":"'HVAC & Envelope'!H49","v":0},4,{"$f":"'HVAC & Envelope'!G49","v":0},null,null,null,null,null,null,null,null,null,null,null,null,null,null,null,null,null,null,null,null,null,null,null,null,null,null,null,{"$f":"'HVAC & Envelope'!I49","v":0},null,null,null,null,null,null,null,null,null,null,null,null,null,null,null,null,null,null,null,null,null,null,0,{"$f":"'HVAC & Envelope'!J49","v":0}]
[null,null,null,null,null,null,null,null,"Small Commercial Smart Thermostats",1,{"$f":"INDEX('Savings Summary'!$Q$8:$Q$51,MATCH('DSMT Export'!I123,'Savings Summary'!$C$8:$C$51,0))","v":"a1r3u000003Fim2AAC"},{"$f":"INDEX('Savings Summary'!$R$8:$R$51,MATCH('DSMT Export'!I123,'Savings Summary'!$C$8:$C$51,0))","v":"0123u000000VQd5AAG"},0,0,{"$f":"ROUND('HVAC & Envelope'!B53,3)","v":0},{"$f":"0","v":0},{"$f":"ROUND(MAX(O123:P123,'HVAC & Envelope'!C53),3)","v":0},{"$f":"ROUND('HVAC & Envelope'!D53,0)","v":0},{"$f":"'HVAC & Envelope'!E53","v":0},{"$f":"'HVAC & Envelope'!F53","v":0},null,null,null,null,4,{"$f":"'HVAC & Envelope'!G53","v":0},null,null,null,null,null,null,null,null,null,null,null,null,null,null,null,null,null,null,null,null,null,null,null,null,null,null,{"$f":"'HVAC & Envelope'!H53","v":0},null,null,null,null,null,null,null,null,null,null,null,null,null,null,{"$f":"IF(RIGHT(BA123,7)=\"Chiller\",'HVAC & Envelope'!M53,\"\")","v":""},{"$f":"IF(RIGHT(BA123,7)=\"Chiller\",\"\",12000*'HVAC & Envelope'!M53)","v":0},null,{"$f":"IF(RIGHT(BA123,7)=\"Chiller\",'HVAC & Envelope'!N53,\"\")","v":""},null,{"$f":"IF(RIGHT(BA123,7)=\"Chiller\",\"\",IF(BQ123<=60000,12/'HVAC & Envelope'!N53,\"\"))","v":{"$error":"#DIV/0!"}},{"$f":"IF(RIGHT(BA123,7)=\"Chiller\",\"\",IF(BQ123>60000,12/'HVAC & Envelope'!N53,\"\"))","v":""},{"$f":"IF(RIGHT(BA123,4)=\"Pump\",IF(BQ123<=60000,3.412*'HVAC & Envelope'!O53,\"\"),\"\")","v":""},{"$f":"IF(RIGHT(BA123,4)=\"Pump\",IF(BQ123>60000,'HVAC & Envelope'!O53,\"\"),\"\")","v":""}]
[null,null,null,null,null,null,null,null,"Small Commercial Smart Thermostats",2,{"$f":"INDEX('Savings Summary'!$Q$8:$Q$51,MATCH('DSMT Export'!I124,'Savings Summary'!$C$8:$C$51,0))","v":"a1r3u000003Fim2AAC"},{"$f":"INDEX('Savings Summary'!$R$8:$R$51,MATCH('DSMT Export'!I124,'Savings Summary'!$C$8:$C$51,0))","v":"0123u000000VQd5AAG"},0,0,{"$f":"ROUND('HVAC & Envelope'!B54,3)","v":0},{"$f":"0","v":0},{"$f":"ROUND(MAX(O124:P124,'HVAC & Envelope'!C54),3)","v":0},{"$f":"ROUND('HVAC & Envelope'!D54,0)","v":0},{"$f":"'HVAC & Envelope'!E54","v":0},{"$f":"'HVAC & Envelope'!F54","v":0},null,null,null,null,4,{"$f":"'HVAC & Envelope'!G54","v":0},null,null,null,null,null,null,null,null,null,null,null,null,null,null,null,null,null,null,null,null,null,null,null,null,null,null,{"$f":"'HVAC & Envelope'!H54","v":0},null,null,null,null,null,null,null,null,null,null,null,null,null,null,{"$f":"IF(RIGHT(BA124,7)=\"Chiller\",'HVAC & Envelope'!M54,\"\")","v":""},{"$f":"IF(RIGHT(BA124,7)=\"Chiller\",\"\",12000*'HVAC & Envelope'!M54)","v":0},null,{"$f":"IF(RIGHT(BA124,7)=\"Chiller\",'HVAC & Envelope'!N54,\"\")","v":""},null,{"$f":"IF(RIGHT(BA124,7)=\"Chiller\",\"\",IF(BQ124<=60000,12/'HVAC & Envelope'!N54,\"\"))","v":{"$error":"#DIV/0!"}},{"$f":"IF(RIGHT(BA124,7)=\"Chiller\",\"\",IF(BQ124>60000,12/'HVAC & Envelope'!N54,\"\"))","v":""},{"$f":"IF(RIGHT(BA124,4)=\"Pump\",IF(BQ124<=60000,3.412*'HVAC & Envelope'!O54,\"\"),\"\")","v":""},{"$f":"IF(RIGHT(BA124,4)=\"Pump\",IF(BQ124>60000,'HVAC & Envelope'!O54,\"\"),\"\")","v":""}]
[null,null,null,null,null,null,null,null,"Small Commercial Smart Thermostats",3,{"$f":"INDEX('Savings Summary'!$Q$8:$Q$51,MATCH('DSMT Export'!I125,'Savings Summary'!$C$8:$C$51,0))","v":"a1r3u000003Fim2AAC"},{"$f":"INDEX('Savings Summary'!$R$8:$R$51,MATCH('DSMT Export'!I125,'Savings Summary'!$C$8:$C$51,0))","v":"0123u000000VQd5AAG"},0,0,{"$f":"ROUND('HVAC & Envelope'!B55,3)","v":0},{"$f":"0","v":0},{"$f":"ROUND(MAX(O125:P125,'HVAC & Envelope'!C55),3)","v":0},{"$f":"ROUND('HVAC & Envelope'!D55,0)","v":0},{"$f":"'HVAC & Envelope'!E55","v":0},{"$f":"'HVAC & Envelope'!F55","v":0},null,null,null,null,4,{"$f":"'HVAC & Envelope'!G55","v":0},null,null,null,null,null,null,null,null,null,null,null,null,null,null,null,null,null,null,null,null,null,null,null,null,null,null,{"$f":"'HVAC & Envelope'!H55","v":0},null,null,null,null,null,null,null,null,null,null,null,null,null,null,{"$f":"IF(RIGHT(BA125,7)=\"Chiller\",'HVAC & Envelope'!M55,\"\")","v":""},{"$f":"IF(RIGHT(BA125,7)=\"Chiller\",\"\",12000*'HVAC & Envelope'!M55)","v":0},null,{"$f":"IF(RIGHT(BA125,7)=\"Chiller\",'HVAC & Envelope'!N55,\"\")","v":""},null,{"$f":"IF(RIGHT(BA125,7)=\"Chiller\",\"\",IF(BQ125<=60000,12/'HVAC & Envelope'!N55,\"\"))","v":{"$error":"#DIV/0!"}},{"$f":"IF(RIGHT(BA125,7)=\"Chiller\",\"\",IF(BQ125>60000,12/'HVAC & Envelope'!N55,\"\"))","v":""},{"$f":"IF(RIGHT(BA125,4)=\"Pump\",IF(BQ125<=60000,3.412*'HVAC & Envelope'!O55,\"\"),\"\")","v":""},{"$f":"IF(RIGHT(BA125,4)=\"Pump\",IF(BQ125>60000,'HVAC & Envelope'!O55,\"\"),\"\")","v":""}]
[null,null,null,null,null,null,null,null,"High-Volume Low-Speed (HVLS) Fans",1,{"$f":"INDEX('Savings Summary'!$Q$8:$Q$51,MATCH('DSMT Export'!I126,'Savings Summary'!$C$8:$C$51,0))","v":"a1r3u000003FilQAAS"},{"$f":"INDEX('Savings Summary'!$R$8:$R$51,MATCH('DSMT Export'!I126,'Savings Summary'!$C$8:$C$51,0))","v":"0123u000000VQdAAAW"},0,0,{"$f":"ROUND('HVAC & Envelope'!B59,3)","v":0},{"$f":"0","v":0},{"$f":"ROUND(MAX(O126:P126,'HVAC & Envelope'!C59),3)","v":0},{"$f":"ROUND('HVAC & Envelope'!D59,0)","v":0},{"$f":"'HVAC & Envelope'!E59","v":0},{"$f":"'HVAC & Envelope'!F59","v":0},null,null,null,null,4,null,null,null,null,null,null,null,null,null,null,null,null,null,null,null,null,null,null,null,null,null,null,null,null,null,null,null,null,null,null,null,null,null,null,null,null,{"$f":"'HVAC & Envelope'!G59","v":0},null,null,null,null,{"$f":"'HVAC & Envelope'!H59","v":0}]
[null,null,null,null,null,null,null,null,"High-Volume Low-Speed (HVLS) Fans",2,{"$f":"INDEX('Savings Summary'!$Q$8:$Q$51,MATCH('DSMT Export'!I127,'Savings Summary'!$C$8:$C$51,0))","v":"a1r3u000003FilQAAS"},{"$f":"INDEX('Savings Summary'!$R$8:$R$51,MATCH('DSMT Export'!I127,'Savings Summary'!$C$8:$C$51,0))","v":"0123u000000VQdAAAW"},0,0,{"$f":"ROUND('HVAC & Envelope'!B60,3)","v":0},{"$f":"0","v":0},{"$f":"ROUND(MAX(O127:P127,'HVAC & Envelope'!C60),3)","v":0},{"$f":"ROUND('HVAC & Envelope'!D60,0)","v":0},{"$f":"'HVAC & Envelope'!E60","v":0},{"$f":"'HVAC & Envelope'!F60","v":0},null,null,null,null,4,null,null,null,null,null,null,null,null,null,null,null,null,null,null,null,null,null,null,null,null,null,null,null,null,null,null,null,null,null,null,null,null,null,null,null,null,{"$f":"'HVAC & Envelope'!G60","v":0},null,null,null,null,{"$f":"'HVAC & Envelope'!H60","v":0}]
[null,null,null,null,null,null,null,null,"High-Volume Low-Speed (HVLS) Fans",3,{"$f":"INDEX('Savings Summary'!$Q$8:$Q$51,MATCH('DSMT Export'!I128,'Savings Summary'!$C$8:$C$51,0))","v":"a1r3u000003FilQAAS"},{"$f":"INDEX('Savings Summary'!$R$8:$R$51,MATCH('DSMT Export'!I128,'Savings Summary'!$C$8:$C$51,0))","v":"0123u000000VQdAAAW"},0,0,{"$f":"ROUND('HVAC & Envelope'!B61,3)","v":0},{"$f":"0","v":0},{"$f":"ROUND(MAX(O128:P128,'HVAC & Envelope'!C61),3)","v":0},{"$f":"ROUND('HVAC & Envelope'!D61,0)","v":0},{"$f":"'HVAC & Envelope'!E61","v":0},{"$f":"'HVAC & Envelope'!F61","v":0},null,null,null,null,4,null,null,null,null,null,null,null,null,null,null,null,null,null,null,null,null,null,null,null,null,null,null,null,null,null,null,null,null,null,null,null,null,null,null,null,null,{"$f":"'HVAC & Envelope'!G61","v":0},null,null,null,null,{"$f":"'HVAC & Envelope'!H61","v":0}]
[null,null,null,null,null,null,null,null,"ECM or VFD for Computer Room Air Handlers",1,{"$f":"INDEX('Savings Summary'!$Q$8:$Q$51,MATCH('DSMT Export'!I129,'Savings Summary'!$C$8:$C$51,0))","v":0},{"$f":"INDEX('Savings Summary'!$R$8:$R$51,MATCH('DSMT Export'!I129,'Savings Summary'!$C$8:$C$51,0))","v":0},{"$f":"APID","v":0},{"$f":"EAID","v":0},{"$f":"ROUND('HVAC & Envelope'!B65,3)","v":0},{"$f":"0","v":0},{"$f":"ROUND(MAX(O129:P129,'HVAC & Envelope'!C65),3)","v":0},{"$f":"ROUND('HVAC & Envelope'!D65,0)","v":0},{"$f":"'HVAC & Envelope'!E65","v":0},{"$f":"'HVAC & Envelope'!F65","v":0},null,null,null,null,4,null,null,null,null,null,null,null,null,null,null,null,null,null,null,null,null,null,null,null,null,null,null,null,null,null,null,null,null,null,null,null,null,null,null,null,{"$f":"'HVAC & Envelope'!G65","v":0}]
[null,null,null,null,null,null,null,null,"ECM or VFD for Computer Room Air Handlers",2,{"$f":"INDEX('Savings Summary'!$Q$8:$Q$51,MATCH('DSMT Export'!I130,'Savings Summary'!$C$8:$C$51,0))","v":0},{"$f":"INDEX('Savings Summary'!$R$8:$R$51,MATCH('DSMT Export'!I130,'Savings Summary'!$C$8:$C$51,0))","v":0},0,0,{"$f":"ROUND('HVAC & Envelope'!B66,3)","v":0},{"$f":"0","v":0},{"$f":"ROUND(MAX(O130:P130,'HVAC & Envelope'!C66),3)","v":0},{"$f":"ROUND('HVAC & Envelope'!D66,0)","v":0},{"$f":"'HVAC & Envelope'!E66","v":0},{"$f":"'HVAC & Envelope'!F66","v":0},null,null,null,null,{"$f":"SelectedZone","v":4},null,null,null,null,null,null,null,null,null,null,null,null,null,null,null,null,null,null,null,null,null,null,null,null,null,null,null,null,null,null,null,null,null,null,null,{"$f":"'HVAC & Envelope'!G66","v":0}]
[null,null,null,null,null,null,null,null,"ECM or VFD for Computer Room Air Handlers",3,{"$f":"INDEX('Savings Summary'!$Q$8:$Q$51,MATCH('DSMT Export'!I131,'Savings Summary'!$C$8:$C$51,0))","v":0},{"$f":"INDEX('Savings Summary'!$R$8:$R$51,MATCH('DSMT Export'!I131,'Savings Summary'!$C$8:$C$51,0))","v":0},0,0,{"$f":"ROUND('HVAC & Envelope'!B67,3)","v":0},{"$f":"0","v":0},{"$f":"ROUND(MAX(O131:P131,'HVAC & Envelope'!C67),3)","v":0},{"$f":"ROUND('HVAC & Envelope'!D67,0)","v":0},{"$f":"'HVAC & Envelope'!E67","v":0},{"$f":"'HVAC & Envelope'!F67","v":0},null,null,null,null,4,null,null,null,null,null,null,null,null,null,null,null,null,null,null,null,null,null,null,null,null,null,null,null,null,null,null,null,null,null,null,null,null,null,null,null,{"$f":"'HVAC & Envelope'!G67","v":0}]
[null,null,null,null,null,null,null,null,"ENERGY STAR Commercial Pool Pumps",1,{"$f":"INDEX('Savings Summary'!$Q$8:$Q$51,MATCH('DSMT Export'!I132,'Savings Summary'!$C$8:$C$51,0))","v":"a1r3u000003FilnAAC"},{"$f":"INDEX('Savings Summary'!$R$8:$R$51,MATCH('DSMT Export'!I132,'Savings Summary'!$C$8:$C$51,0))","v":"0123u000000VQd3AAG"},0,0,{"$f":"ROUND(Motors!B5,3)","v":0},{"$f":"0","v":0},{"$f":"ROUND(MAX(O132:P132,Motors!C5),3)","v":0},{"$f":"ROUND(Motors!D5,0)","v":0},{"$f":"Motors!E5","v":0},{"$f":"Motors!F5","v":0},null,{"$f":"Motors!H5","v":0},null,null,4,null,null,null,null,null,null,null,null,null,null,null,null,null,null,null,null,null,null,null,null,null,null,null,null,null,null,null,null,null,null,null,null,null,null,null,null,null,{"$f":"SUBSTITUTE(Motors!G5,\"≤\",\"<=\")","v":""}]
[null,null,null,null,null,null,null,null,"ENERGY STAR Commercial Pool Pumps",2,{"$f":"INDEX('Savings Summary'!$Q$8:$Q$51,MATCH('DSMT Export'!I133,'Savings Summary'!$C$8:$C$51,0))","v":"a1r3u000003FilnAAC"},{"$f":"INDEX('Savings Summary'!$R$8:$R$51,MATCH('DSMT Export'!I133,'Savings Summary'!$C$8:$C$51,0))","v":"0123u000000VQd3AAG"},0,0,{"$f":"ROUND(Motors!B6,3)","v":0},{"$f":"0","v":0},{"$f":"ROUND(MAX(O133:P133,Motors!C6),3)","v":0},{"$f":"ROUND(Motors!D6,0)","v":0},{"$f":"Motors!E6","v":0},{"$f":"Motors!F6","v":0},null,{"$f":"Motors!H6","v":0},null,null,4,null,null,null,null,null,null,null,null,null,null,null,null,null,null,null,null,null,null,null,null,null,null,null,null,null,null,null,null,null,null,null,null,null,null,null,null,null,{"$f":"SUBSTITUTE(Motors!G6,\"≤\",\"<=\")","v":""}]
[null,null,null,null,null,null,null,null,"ENERGY STAR Commercial Pool Pumps",3,{"$f":"INDEX('Savings Summary'!$Q$8:$Q$51,MATCH('DSMT Export'!I134,'Savings Summary'!$C$8:$C$51,0))","v":"a1r3u000003FilnAAC"},{"$f":"INDEX('Savings Summary'!$R$8:$R$51,MATCH('DSMT Export'!I134,'Savings Summary'!$C$8:$C$51,0))","v":"0123u000000VQd3AAG"},0,0,{"$f":"ROUND(Motors!B7,3)","v":0},{"$f":"0","v":0},{"$f":"ROUND(MAX(O134:P134,Motors!C7),3)","v":0},{"$f":"ROUND(Motors!D7,0)","v":0},{"$f":"Motors!E7","v":0},{"$f":"Motors!F7","v":0},null,{"$f":"Motors!H7","v":0},null,null,4,null,null,null,null,null,null,null,null,null,null,null,null,null,null,null,null,null,null,null,null,null,null,null,null,null,null,null,null,null,null,null,null,null,null,null,null,null,{"$f":"SUBSTITUTE(Motors!G7,\"≤\",\"<=\")","v":""}]
[null,null,null,null,null,null,null,null,"Premium Efficiency Motors",1,{"$f":"INDEX('Savings Summary'!$Q$8:$Q$51,MATCH('DSMT Export'!I135,'Savings Summary'!$C$8:$C$51,0))","v":"a1r3u000003FilpAAC"},{"$f":"INDEX('Savings Summary'!$R$8:$R$51,MATCH('DSMT Export'!I135,'Savings Summary'!$C$8:$C$51,0))","v":"0123u000000VQdUAAW"},0,0,{"$f":"ROUND(Motors!B11,3)","v":0},{"$f":"0","v":0},{"$f":"ROUND(MAX(O135:P135,Motors!C11),3)","v":0},{"$f":"ROUND(Motors!D11,0)","v":0},{"$f":"Motors!E11","v":0},{"$f":"Motors!F11","v":0},null,{"$f":"Motors!G11","v":0},null,{"$f":"Motors!K11","v":0},4,null,{"$f":"Motors!H11","v":0},null,null,null,null,null,null,null,null,null,null,null,{"$f":"Motors!O11","v":{"$error":"#N/A"}},null,null,null,null,null,null,null,null,null,null,null,null,null,null,null,null,null,null,null,{"$f":"IF(AA135=\"Early Retirement\",Motors!I11 & \" years old\",\"\")","v":""},null,{"$f":"Motors!J11","v":0},null,null,{"$f":"Motors!L11","v":0}]
[null,null,null,null,null,null,null,null,"Premium Efficiency Motors",2,{"$f":"INDEX('Savings Summary'!$Q$8:$Q$51,MATCH('DSMT Export'!I136,'Savings Summary'!$C$8:$C$51,0))","v":"a1r3u000003FilpAAC"},{"$f":"INDEX('Savings Summary'!$R$8:$R$51,MATCH('DSMT Export'!I136,'Savings Summary'!$C$8:$C$51,0))","v":"0123u000000VQdUAAW"},0,0,{"$f":"ROUND(Motors!B12,3)","v":0},{"$f":"0","v":0},{"$f":"ROUND(MAX(O136:P136,Motors!C12),3)","v":0},{"$f":"ROUND(Motors!D12,0)","v":0},{"$f":"Motors!E12","v":0},{"$f":"Motors!F12","v":0},null,{"$f":"Motors!G12","v":0},null,{"$f":"Motors!K12","v":0},4,null,{"$f":"Motors!H12","v":0},null,null,null,null,null,null,null,null,null,null,null,{"$f":"Motors!O12","v":{"$error":"#N/A"}},null,null,null,null,null,null,null,null,null,null,null,null,null,null,null,null,null,null,null,{"$f":"IF(AA136=\"Early Retirement\",Motors!I12 & \" years old\",\"\")","v":""},null,{"$f":"Motors!J12","v":0},null,null,{"$f":"Motors!L12","v":0}]
[null,null,null,null,null,null,null,null,"Premium Efficiency Motors",3,{"$f":"INDEX('Savings Summary'!$Q$8:$Q$51,MATCH('DSMT Export'!I137,'Savings Summary'!$C$8:$C$51,0))","v":"a1r3u000003FilpAAC"},{"$f":"INDEX('Savings Summary'!$R$8:$R$51,MATCH('DSMT Export'!I137,'Savings Summary'!$C$8:$C$51,0))","v":"0123u000000VQdUAAW"},0,0,{"$f":"ROUND(Motors!B13,3)","v":0},{"$f":"0","v":0},{"$f":"ROUND(MAX(O137:P137,Motors!C13),3)","v":0},{"$f":"ROUND(Motors!D13,0)","v":0},{"$f":"Motors!E13","v":0},{"$f":"Motors!F13","v":0},null,{"$f":"Motors!G13","v":0},null,{"$f":"Motors!K13","v":0},4,null,{"$f":"Motors!H13","v":0},null,null,null,null,null,null,null,null,null,null,null,{"$f":"Motors!O13","v":{"$error":"#N/A"}},null,null,null,null,null,null,null,null,null,null,null,null,null,null,null,null,null,null,null,{"$f":"IF(AA137=\"Early Retirement\",Motors!I13 & \" years old\",\"\")","v":""},null,{"$f":"Motors!J13","v":0},null,null,{"$f":"Motors!L13","v":0}]
[null,null,null,null,null,null,null,null,"Premium Efficiency Motors",4,{"$f":"INDEX('Savings Summary'!$Q$8:$Q$51,MATCH('DSMT Export'!I138,'Savings Summary'!$C$8:$C$51,0))","v":"a1r3u000003FilpAAC"},{"$f":"INDEX('Savings Summary'!$R$8:$R$51,MATCH('DSMT Export'!I138,'Savings Summary'!$C$8:$C$51,0))","v":"0123u000000VQdUAAW"},0,0,{"$f":"ROUND(Motors!B14,3)","v":0},{"$f":"0","v":0},{"$f":"ROUND(MAX(O138:P138,Motors!C14),3)","v":0},{"$f":"ROUND(Motors!D14,0)","v":0},{"$f":"Motors!E14","v":0},{"$f":"Motors!F14","v":0},null,{"$f":"Motors!G14","v":0},null,{"$f":"Motors!K14","v":0},4,null,{"$f":"Motors!H14","v":0},null,null,null,null,null,null,null,null,null,null,null,{"$f":"Motors!O14","v":{"$error":"#N/A"}},null,null,null,null,null,null,null,null,null,null,null,null,null,null,null,null,null,null,null,{"$f":"IF(AA138=\"Early Retirement\",Motors!I14 & \" years old\",\"\")","v":""},null,{"$f":"Motors!J14","v":0},null,null,{"$f":"Motors!L14","v":0}]
[null,null,null,null,null,null,null,null,"Premium Efficiency Motors",5,{"$f":"INDEX('Savings Summary'!$Q$8:$Q$51,MATCH('DSMT Export'!I139,'Savings Summary'!$C$8:$C$51,0))","v":"a1r3u000003FilpAAC"},{"$f":"INDEX('Savings Summary'!$R$8:$R$51,MATCH('DSMT Export'!I139,'Savings Summary'!$C$8:$C$51,0))","v":"0123u000000VQdUAAW"},0,0,{"$f":"ROUND(Motors!B15,3)","v":0},{"$f":"0","v":0},{"$f":"ROUND(MAX(O139:P139,Motors!C15),3)","v":0},{"$f":"ROUND(Motors!D15,0)","v":0},{"$f":"Motors!E15","v":0},{"$f":"Motors!F15","v":0},null,{"$f":"Motors!G15","v":0},null,{"$f":"Motors!K15","v":0},4,null,{"$f":"Motors!H15","v":0},null,null,null,null,null,null,null,null,null,null,null,{"$f":"Motors!O15","v":{"$error":"#N/A"}},null,null,null,null,null,null,null,null,null,null,null,null,null,null,null,null,null,null,null,{"$f":"IF(AA139=\"Early Retirement\",Motors!I15 & \" years old\",\"\")","v":""},null,{"$f":"Motors!J15","v":0},null,null,{"$f":"Motors!L15","v":0}]
[null,null,null,null,null,null,null,null,"Pump-Off Controllers",1,{"$f":"INDEX('Savings Summary'!$Q$8:$Q$51,MATCH('DSMT Export'!I140,'Savings Summary'!$C$8:$C$51,0))","v":"a1r3u000003FilxAAC"},{"$f":"INDEX('Savings Summary'!$R$8:$R$51,MATCH('DSMT Export'!I140,'Savings Summary'!$C$8:$C$51,0))","v":"0123u000000VQd4AAG"},0,0,{"$f":"ROUND(Motors!B19,3)","v":0},{"$f":"0","v":0},{"$f":"ROUND(MAX(O140:P140,Motors!C19),3)","v":0},{"$f":"ROUND(Motors!D19,0)","v":0},{"$f":"Motors!E19","v":0},{"$f":"Motors!F19","v":0},null,{"$f":"Motors!H19","v":0},null,null,4,null,null,null,null,null,null,null,null,null,null,null,null,null,null,null,null,null,null,null,null,null,null,null,null,null,null,null,null,null,null,null,null,null,null,null,null,null,{"$f":"Motors!G19","v":0},null,{"$f":"Motors!I19*100","v":0}]
[null,null,null,null,null,null,null,null,"Pump-Off Controllers",2,{"$f":"INDEX('Savings Summary'!$Q$8:$Q$51,MATCH('DSMT Export'!I141,'Savings Summary'!$C$8:$C$51,0))","v":"a1r3u000003FilxAAC"},{"$f":"INDEX('Savings Summary'!$R$8:$R$51,MATCH('DSMT Export'!I141,'Savings Summary'!$C$8:$C$51,0))","v":"0123u000000VQd4AAG"},0,0,{"$f":"ROUND(Motors!B20,3)","v":0},{"$f":"0","v":0},{"$f":"ROUND(MAX(O141:P141,Motors!C20),3)","v":0},{"$f":"ROUND(Motors!D20,0)","v":0},{"$f":"Motors!E20","v":0},{"$f":"Motors!F20","v":0},null,{"$f":"Motors!H20","v":0},null,null,4,null,null,null,null,null,null,null,null,null,null,null,null,null,null,null,null,null,null,null,null,null,null,null,null,null,null,null,null,null,null,null,null,null,null,null,null,null,{"$f":"Motors!G20","v":0},null,{"$f":"Motors!I20*100","v":0}]
[null,null,null,null,null,null,null,null,"Pump-Off Controllers",3,{"$f":"INDEX('Savings Summary'!$Q$8:$Q$51,MATCH('DSMT Export'!I142,'Savings Summary'!$C$8:$C$51,0))","v":"a1r3u000003FilxAAC"},{"$f":"INDEX('Savings Summary'!$R$8:$R$51,MATCH('DSMT Export'!I142,'Savings Summary'!$C$8:$C$51,0))","v":"0123u000000VQd4AAG"},0,0,{"$f":"ROUND(Motors!B21,3)","v":0},{"$f":"0","v":0},{"$f":"ROUND(MAX(O142:P142,Motors!C21),3)","v":0},{"$f":"ROUND(Motors!D21,0)","v":0},{"$f":"Motors!E21","v":0},{"$f":"Motors!F21","v":0},null,{"$f":"Motors!H21","v":0},null,null,4,null,null,null,null,null,null,null,null,null,null,null,null,null,null,null,null,null,null,null,null,null,null,null,null,null,null,null,null,null,null,null,null,null,null,null,null,null,{"$f":"Motors!G21","v":0},null,{"$f":"Motors!I21*100","v":0}]
[null,null,null,null,null,null,null,null,"VFDs for Water Pumping",1,{"$f":"INDEX('Savings Summary'!$Q$8:$Q$51,MATCH('DSMT Export'!I143,'Savings Summary'!$C$8:$C$51,0))","v":0},{"$f":"INDEX('Savings Summary'!$R$8:$R$51,MATCH('DSMT Export'!I143,'Savings Summary'!$C$8:$C$51,0))","v":0},0,0,{"$f":"0","v":0},{"$f":"ROUND(Motors!B25,3)","v":0},{"$f":"ROUND(MAX(O143:P143,Motors!C25),3)","v":0},{"$f":"ROUND(Motors!D25,0)","v":0},{"$f":"Motors!E25","v":0},{"$f":"Motors!F25","v":0},null,null,null,null,4,null,null,null,null,null,null,null,null,null,null,null,null,null,null,null,null,null,null,null,null,null,null,null,null,null,null,null,null,null,null,null,null,null,null,null,{"$f":"Motors!G25","v":0}]
[null,null,null,null,null,null,null,null,"VFDs for Water Pumping",2,{"$f":"INDEX('Savings Summary'!$Q$8:$Q$51,MATCH('DSMT Export'!I144,'Savings Summary'!$C$8:$C$51,0))","v":0},{"$f":"INDEX('Savings Summary'!$R$8:$R$51,MATCH('DSMT Export'!I144,'Savings Summary'!$C$8:$C$51,0))","v":0},0,0,{"$f":"0","v":0},{"$f":"ROUND(Motors!B26,3)","v":0},{"$f":"ROUND(MAX(O144:P144,Motors!C26),3)","v":0},{"$f":"ROUND(Motors!D26,0)","v":0},{"$f":"Motors!E26","v":0},{"$f":"Motors!F26","v":0},null,null,null,null,4,null,null,null,null,null,null,null,null,null,null,null,null,null,null,null,null,null,null,null,null,null,null,null,null,null,null,null,null,null,null,null,null,null,null,null,{"$f":"Motors!G26","v":0}]
[null,null,null,null,null,null,null,null,"VFDs for Water Pumping",3,{"$f":"INDEX('Savings Summary'!$Q$8:$Q$51,MATCH('DSMT Export'!I145,'Savings Summary'!$C$8:$C$51,0))","v":0},{"$f":"INDEX('Savings Summary'!$R$8:$R$51,MATCH('DSMT Export'!I145,'Savings Summary'!$C$8:$C$51,0))","v":0},0,0,{"$f":"0","v":0},{"$f":"ROUND(Motors!B27,3)","v":0},{"$f":"ROUND(MAX(O145:P145,Motors!C27),3)","v":0},{"$f":"ROUND(Motors!D27,0)","v":0},{"$f":"Motors!E27","v":0},{"$f":"Motors!F27","v":0},null,null,null,null,4,null,null,null,null,null,null,null,null,null,null,null,null,null,null,null,null,null,null,null,null,null,null,null,null,null,null,null,null,null,null,null,null,null,null,null,{"$f":"Motors!G27","v":0}]
[null,null,null,null,null,null,null,null,"Hydraulic Oils & Gear Lubricants",1,{"$f":"INDEX('Savings Summary'!$Q$8:$Q$51,MATCH('DSMT Export'!I146,'Savings Summary'!$C$8:$C$51,0))","v":0},{"$f":"INDEX('Savings Summary'!$R$8:$R$51,MATCH('DSMT Export'!I146,'Savings Summary'!$C$8:$C$51,0))","v":0},0,0,{"$f":"ROUND(Motors!B31,3)","v":0},{"$f":"0","v":0},{"$f":"ROUND(MAX(O146:P146,Motors!C31),3)","v":0},{"$f":"ROUND(Motors!D31,0)","v":0},{"$f":"Motors!E31","v":0},{"$f":"Motors!F31","v":0},null,null,null,{"$f":"Motors!H31","v":0},4,null,null,null,null,null,null,null,null,null,null,null,null,null,{"$f":"Motors!I31","v":0},null,null,null,null,null,null,null,null,null,null,null,null,null,null,null,null,null,null,null,null,null,{"$f":"Motors!G31","v":0}]
[null,null,null,null,null,null,null,null,"Hydraulic Oils & Gear Lubricants",2,{"$f":"INDEX('Savings Summary'!$Q$8:$Q$51,MATCH('DSMT Export'!I147,'Savings Summary'!$C$8:$C$51,0))","v":0},{"$f":"INDEX('Savings Summary'!$R$8:$R$51,MATCH('DSMT Export'!I147,'Savings Summary'!$C$8:$C$51,0))","v":0},0,0,{"$f":"ROUND(Motors!B32,3)","v":0},{"$f":"0","v":0},{"$f":"ROUND(MAX(O147:P147,Motors!C32),3)","v":0},{"$f":"ROUND(Motors!D32,0)","v":0},{"$f":"Motors!E32","v":0},{"$f":"Motors!F32","v":0},null,null,null,{"$f":"Motors!H32","v":0},4,null,null,null,null,null,null,null,null,null,null,null,null,null,{"$f":"Motors!I32","v":0},null,null,null,null,null,null,null,null,null,null,null,null,null,null,null,null,null,null,null,null,null,{"$f":"Motors!G32","v":0}]
[null,null,null,null,null,null,null,null,"Hydraulic Oils & Gear Lubricants",3,{"$f":"INDEX('Savings Summary'!$Q$8:$Q$51,MATCH('DSMT Export'!I148,'Savings Summary'!$C$8:$C$51,0))","v":0},{"$f":"INDEX('Savings Summary'!$R$8:$R$51,MATCH('DSMT Export'!I148,'Savings Summary'!$C$8:$C$51,0))","v":0},0,0,{"$f":"ROUND(Motors!B33,3)","v":0},{"$f":"0","v":0},{"$f":"ROUND(MAX(O148:P148,Motors!C33),3)","v":0},{"$f":"ROUND(Motors!D33,0)","v":0},{"$f":"Motors!E33","v":0},{"$f":"Motors!F33","v":0},null,null,null,{"$f":"Motors!H33","v":0},4,null,null,null,null,null,null,null,null,null,null,null,null,null,{"$f":"Motors!I33","v":0},null,null,null,null,null,null,null,null,null,null,null,null,null,null,null,null,null,null,null,null,null,{"$f":"Motors!G33","v":0}]
[null,null,null,null,null,null,null,null,"Hydraulic Oils & Gear Lubricants",4,{"$f":"INDEX('Savings Summary'!$Q$8:$Q$51,MATCH('DSMT Export'!I149,'Savings Summary'!$C$8:$C$51,0))","v":0},{"$f":"INDEX('Savings Summary'!$R$8:$R$51,MATCH('DSMT Export'!I149,'Savings Summary'!$C$8:$C$51,0))","v":0},0,0,{"$f":"ROUND(Motors!B34,3)","v":0},{"$f":"0","v":0},{"$f":"ROUND(MAX(O149:P149,Motors!C34),3)","v":0},{"$f":"ROUND(Motors!D34,0)","v":0},{"$f":"Motors!E34","v":0},{"$f":"Motors!F34","v":0},null,null,null,{"$f":"Motors!H34","v":0},4,null,null,null,null,null,null,null,null,null,null,null,null,null,{"$f":"Motors!I34","v":0},null,null,null,null,null,null,null,null,null,null,null,null,null,null,null,null,null,null,null,null,null,{"$f":"Motors!G34","v":0}]
[null,null,null,null,null,null,null,null,"Hydraulic Oils & Gear Lubricants",5,{"$f":"INDEX('Savings Summary'!$Q$8:$Q$51,MATCH('DSMT Export'!I150,'Savings Summary'!$C$8:$C$51,0))","v":0},{"$f":"INDEX('Savings Summary'!$R$8:$R$51,MATCH('DSMT Export'!I150,'Savings Summary'!$C$8:$C$51,0))","v":0},0,0,{"$f":"ROUND(Motors!B35,3)","v":0},{"$f":"0","v":0},{"$f":"ROUND(MAX(O150:P150,Motors!C35),3)","v":0},{"$f":"ROUND(Motors!D35,0)","v":0},{"$f":"Motors!E35","v":0},{"$f":"Motors!F35","v":0},null,null,null,{"$f":"Motors!H35","v":0},4,null,null,null,null,null,null,null,null,null,null,null,null,null,{"$f":"Motors!I35","v":0},null,null,null,null,null,null,null,null,null,null,null,null,null,null,null,null,null,null,null,null,null,{"$f":"Motors!G35","v":0}]
[null,null,null,null,null,null,null,null,"PC Power Management (PCPM)",1,{"$f":"INDEX('Savings Summary'!$Q$8:$Q$51,MATCH('DSMT Export'!I151,'Savings Summary'!$C$8:$C$51,0))","v":0},{"$f":"INDEX('Savings Summary'!$R$8:$R$51,MATCH('DSMT Export'!I151,'Savings Summary'!$C$8:$C$51,0))","v":0},0,0,{"$f":"ROUND(Misc!B5,3)","v":0},{"$f":"0","v":0},{"$f":"ROUND(MAX(O151:P151,Misc!C5),3)","v":0},{"$f":"ROUND(Misc!D5,0)","v":0},{"$f":"Misc!E5","v":0},{"$f":"Misc!F5","v":0},null,null,null,{"$f":"Misc!G5","v":0},4]
[null,null,null,null,null,null,null,null,"PC Power Management (PCPM)",2,{"$f":"INDEX('Savings Summary'!$Q$8:$Q$51,MATCH('DSMT Export'!I152,'Savings Summary'!$C$8:$C$51,0))","v":0},{"$f":"INDEX('Savings Summary'!$R$8:$R$51,MATCH('DSMT Export'!I152,'Savings Summary'!$C$8:$C$51,0))","v":0},0,0,{"$f":"ROUND(Misc!B6,3)","v":0},{"$f":"0","v":0},{"$f":"ROUND(MAX(O152:P152,Misc!C6),3)","v":0},{"$f":"ROUND(Misc!D6,0)","v":0},{"$f":"Misc!E6","v":0},{"$f":"Misc!F6","v":0},null,null,null,{"$f":"Misc!G6","v":0},4]
[null,null,null,null,null,null,null,null,"PC Power Management (PCPM)",3,{"$f":"INDEX('Savings Summary'!$Q$8:$Q$51,MATCH('DSMT Export'!I153,'Savings Summary'!$C$8:$C$51,0))","v":0},{"$f":"INDEX('Savings Summary'!$R$8:$R$51,MATCH('DSMT Export'!I153,'Savings Summary'!$C$8:$C$51,0))","v":0},0,0,{"$f":"ROUND(Misc!B7,3)","v":0},{"$f":"0","v":0},{"$f":"ROUND(MAX(O153:P153,Misc!C7),3)","v":0},{"$f":"ROUND(Misc!D7,0)","v":0},{"$f":"Misc!E7","v":0},{"$f":"Misc!F7","v":0},null,null,null,{"$f":"Misc!G7","v":0},4]
[null,null,null,null,null,null,null,null,"PC Power Management (PCPM)",4,{"$f":"INDEX('Savings Summary'!$Q$8:$Q$51,MATCH('DSMT Export'!I154,'Savings Summary'!$C$8:$C$51,0))","v":0},{"$f":"INDEX('Savings Summary'!$R$8:$R$51,MATCH('DSMT Export'!I154,'Savings Summary'!$C$8:$C$51,0))","v":0},0,0,{"$f":"ROUND(Misc!B8,3)","v":0},{"$f":"0","v":0},{"$f":"ROUND(MAX(O154:P154,Misc!C8),3)","v":0},{"$f":"ROUND(Misc!D8,0)","v":0},{"$f":"Misc!E8","v":0},{"$f":"Misc!F8","v":0},null,null,null,{"$f":"Misc!G8","v":0},4]
[null,null,null,null,null,null,null,null,"ENERGY STAR Electric Vehicle Supply Equipment (EVSE)",1,{"$f":"INDEX('Savings Summary'!$Q$8:$Q$51,MATCH('DSMT Export'!I155,'Savings Summary'!$C$8:$C$51,0))","v":"a1r3u000003FilJAAS"},{"$f":"INDEX('Savings Summary'!$R$8:$R$51,MATCH('DSMT Export'!I155,'Savings Summary'!$C$8:$C$51,0))","v":"0123u000000VQdIAAW"},0,0,{"$f":"ROUND(IF(Misc!O12,Misc!B12,0),3)","v":0},{"$f":"ROUND(IF(Misc!O12,0,Misc!B12),3)","v":0},{"$f":"ROUND(MAX(O155:P155,Misc!C12),3)","v":0},{"$f":"ROUND(Misc!D12,0)","v":0},{"$f":"Misc!E12","v":0},{"$f":"Misc!F12","v":0},null,{"$f":"Misc!H12","v":0},null,null,4,null,null,null,null,null,null,null,null,null,null,null,null,null,null,null,null,null,null,null,null,null,null,null,null,null,null,null,null,null,null,null,null,null,null,null,null,null,null,null,null,null,null,null,null,null,null,null,null,null,null,null,null,null,{"$f":"Misc!G12","v":0}]
[null,null,null,null,null,null,null,null,"ENERGY STAR Electric Vehicle Supply Equipment (EVSE)",2,{"$f":"INDEX('Savings Summary'!$Q$8:$Q$51,MATCH('DSMT Export'!I156,'Savings Summary'!$C$8:$C$51,0))","v":"a1r3u000003FilJAAS"},{"$f":"INDEX('Savings Summary'!$R$8:$R$51,MATCH('DSMT Export'!I156,'Savings Summary'!$C$8:$C$51,0))","v":"0123u000000VQdIAAW"},0,0,{"$f":"ROUND(IF(Misc!O13,Misc!B13,0),3)","v":0},{"$f":"ROUND(IF(Misc!O13,0,Misc!B13),3)","v":0},{"$f":"ROUND(MAX(O156:P156,Misc!C13),3)","v":0},{"$f":"ROUND(Misc!D13,0)","v":0},{"$f":"Misc!E13","v":0},{"$f":"Misc!F13","v":0},null,{"$f":"Misc!H13","v":0},null,null,4,null,null,null,null,null,null,null,null,null,null,null,null,null,null,null,null,null,null,null,null,null,null,null,null,null,null,null,null,null,null,null,null,null,null,null,null,null,null,null,null,null,null,null,null,null,null,null,null,null,null,null,null,null,{"$f":"Misc!G13","v":0}]
[null,null,null,null,null,null,null,null,"ENERGY STAR Electric Vehicle Supply Equipment (EVSE)",3,{"$f":"INDEX('Savings Summary'!$Q$8:$Q$51,MATCH('DSMT Export'!I157,'Savings Summary'!$C$8:$C$51,0))","v":"a1r3u000003FilJAAS"},{"$f":"INDEX('Savings Summary'!$R$8:$R$51,MATCH('DSMT Export'!I157,'Savings Summary'!$C$8:$C$51,0))","v":"0123u000000VQdIAAW"},0,0,{"$f":"ROUND(IF(Misc!O14,Misc!B14,0),3)","v":0},{"$f":"ROUND(IF(Misc!O14,0,Misc!B14),3)","v":0},{"$f":"ROUND(MAX(O157:P157,Misc!C14),3)","v":0},{"$f":"ROUND(Misc!D14,0)","v":0},{"$f":"Misc!E14","v":0},{"$f":"Misc!F14","v":0},null,{"$f":"Misc!H14","v":0},null,null,4,null,null,null,null,null,null,null,null,null,null,null,null,null,null,null,null,null,null,null,null,null,null,null,null,null,null,null,null,null,null,null,null,null,null,null,null,null,null,null,null,null,null,null,null,null,null,null,null,null,null,null,null,null,{"$f":"Misc!G14","v":0}]
[null,null,null,null,null,null,null,null,"LED Traffic Signals",1,{"$f":"INDEX('Savings Summary'!$Q$8:$Q$51,MATCH('DSMT Export'!I158,'Savings Summary'!$C$8:$C$51,0))","v":0},{"$f":"INDEX('Savings Summary'!$R$8:$R$51,MATCH('DSMT Export'!I158,'Savings Summary'!$C$8:$C$51,0))","v":0},0,0,{"$f":"ROUND(Misc!B18,3)","v":0},{"$f":"0","v":0},{"$f":"ROUND(MAX(O158:P158,Misc!C18),3)","v":0},{"$f":"ROUND(Misc!D18,0)","v":0},{"$f":"Misc!E18","v":0},{"$f":"Misc!F18","v":0},null,null,null,{"$f":"Misc!G18","v":0},4]
[null,null,null,null,null,null,null,null,"LED Traffic Signals",2,{"$f":"INDEX('Savings Summary'!$Q$8:$Q$51,MATCH('DSMT Export'!I159,'Savings Summary'!$C$8:$C$51,0))","v":0},{"$f":"INDEX('Savings Summary'!$R$8:$R$51,MATCH('DSMT Export'!I159,'Savings Summary'!$C$8:$C$51,0))","v":0},0,0,{"$f":"ROUND(Misc!B19,3)","v":0},{"$f":"0","v":0},{"$f":"ROUND(MAX(O159:P159,Misc!C19),3)","v":0},{"$f":"ROUND(Misc!D19,0)","v":0},{"$f":"Misc!E19","v":0},{"$f":"Misc!F19","v":0},null,null,null,{"$f":"Misc!G19","v":0},4]
[null,null,null,null,null,null,null,null,"LED Traffic Signals",3,{"$f":"INDEX('Savings Summary'!$Q$8:$Q$51,MATCH('DSMT Export'!I160,'Savings Summary'!$C$8:$C$51,0))","v":0},{"$f":"INDEX('Savings Summary'!$R$8:$R$51,MATCH('DSMT Export'!I160,'Savings Summary'!$C$8:$C$51,0))","v":0},0,0,{"$f":"ROUND(Misc!B20,3)","v":0},{"$f":"0","v":0},{"$f":"ROUND(MAX(O160:P160,Misc!C20),3)","v":0},{"$f":"ROUND(Misc!D20,0)","v":0},{"$f":"Misc!E20","v":0},{"$f":"Misc!F20","v":0},null,null,null,{"$f":"Misc!G20","v":0},4]
[null,null,null,null,null,null,null,null,"LED Traffic Signals",4,{"$f":"INDEX('Savings Summary'!$Q$8:$Q$51,MATCH('DSMT Export'!I161,'Savings Summary'!$C$8:$C$51,0))","v":0},{"$f":"INDEX('Savings Summary'!$R$8:$R$51,MATCH('DSMT Export'!I161,'Savings Summary'!$C$8:$C$51,0))","v":0},{"$f":"APID","v":0},{"$f":"EAID","v":0},{"$f":"ROUND(Misc!B21,3)","v":0},{"$f":"0","v":0},{"$f":"ROUND(MAX(O161:P161,Misc!C21),3)","v":0},{"$f":"ROUND(Misc!D21,0)","v":0},{"$f":"Misc!E21","v":0},{"$f":"Misc!F21","v":0},null,null,null,{"$f":"Misc!G21","v":0},4]
[null,null,null,null,null,null,null,null,"LED Traffic Signals",5,{"$f":"INDEX('Savings Summary'!$Q$8:$Q$51,MATCH('DSMT Export'!I162,'Savings Summary'!$C$8:$C$51,0))","v":0},{"$f":"INDEX('Savings Summary'!$R$8:$R$51,MATCH('DSMT Export'!I162,'Savings Summary'!$C$8:$C$51,0))","v":0},0,0,{"$f":"ROUND(Misc!B22,3)","v":0},{"$f":"0","v":0},{"$f":"ROUND(MAX(O162:P162,Misc!C22),3)","v":0},{"$f":"ROUND(Misc!D22,0)","v":0},{"$f":"Misc!E22","v":0},{"$f":"Misc!F22","v":0},null,null,null,{"$f":"Misc!G22","v":0},{"$f":"SelectedZone","v":4}]
[null,null,null,null,null,null,null,null,"LED Traffic Signals",6,{"$f":"INDEX('Savings Summary'!$Q$8:$Q$51,MATCH('DSMT Export'!I163,'Savings Summary'!$C$8:$C$51,0))","v":0},{"$f":"INDEX('Savings Summary'!$R$8:$R$51,MATCH('DSMT Export'!I163,'Savings Summary'!$C$8:$C$51,0))","v":0},0,0,{"$f":"ROUND(Misc!B23,3)","v":0},{"$f":"0","v":0},{"$f":"ROUND(MAX(O163:P163,Misc!C23),3)","v":0},{"$f":"ROUND(Misc!D23,0)","v":0},{"$f":"Misc!E23","v":0},{"$f":"Misc!F23","v":0},null,null,null,{"$f":"Misc!G23","v":0},4]
[null,null,null,null,null,null,null,null,"LED Traffic Signals",7,{"$f":"INDEX('Savings Summary'!$Q$8:$Q$51,MATCH('DSMT Export'!I164,'Savings Summary'!$C$8:$C$51,0))","v":0},{"$f":"INDEX('Savings Summary'!$R$8:$R$51,MATCH('DSMT Export'!I164,'Savings Summary'!$C$8:$C$51,0))","v":0},0,0,{"$f":"ROUND(Misc!B24,3)","v":0},{"$f":"0","v":0},{"$f":"ROUND(MAX(O164:P164,Misc!C24),3)","v":0},{"$f":"ROUND(Misc!D24,0)","v":0},{"$f":"Misc!E24","v":0},{"$f":"Misc!F24","v":0},null,null,null,{"$f":"Misc!G24","v":0},4]
[null,null,null,null,null,null,null,null,"LED Traffic Signals",8,{"$f":"INDEX('Savings Summary'!$Q$8:$Q$51,MATCH('DSMT Export'!I165,'Savings Summary'!$C$8:$C$51,0))","v":0},{"$f":"INDEX('Savings Summary'!$R$8:$R$51,MATCH('DSMT Export'!I165,'Savings Summary'!$C$8:$C$51,0))","v":0},0,0,{"$f":"ROUND(Misc!B25,3)","v":0},{"$f":"0","v":0},{"$f":"ROUND(MAX(O165:P165,Misc!C25),3)","v":0},{"$f":"ROUND(Misc!D25,0)","v":0},{"$f":"Misc!E25","v":0},{"$f":"Misc!F25","v":0},null,null,null,{"$f":"Misc!G25","v":0},4]
[null,null,null,null,null,null,null,null,"Steam Trap Repair or Replacement",1,{"$f":"INDEX('Savings Summary'!$Q$8:$Q$51,MATCH('DSMT Export'!I166,'Savings Summary'!$C$8:$C$51,0))","v":0},{"$f":"INDEX('Savings Summary'!$R$8:$R$51,MATCH('DSMT Export'!I166,'Savings Summary'!$C$8:$C$51,0))","v":0},0,0,{"$f":"ROUND(Misc!B29,3)","v":0},{"$f":"0","v":0},{"$f":"ROUND(MAX(O166:P166,Misc!C29),3)","v":0},{"$f":"ROUND(Misc!D29,0)","v":0},{"$f":"Misc!E29","v":0},{"$f":"Misc!G29","v":0},null,{"$f":"Misc!H29","v":0},null,null,4,{"$f":"IF(Misc!J29=\"\",\"\",Misc!J29=\"\")","v":""}]
[null,null,null,null,null,null,null,null,"Steam Trap Repair or Replacement",2,{"$f":"INDEX('Savings Summary'!$Q$8:$Q$51,MATCH('DSMT Export'!I167,'Savings Summary'!$C$8:$C$51,0))","v":0},{"$f":"INDEX('Savings Summary'!$R$8:$R$51,MATCH('DSMT Export'!I167,'Savings Summary'!$C$8:$C$51,0))","v":0},0,0,{"$f":"ROUND(Misc!B30,3)","v":0},{"$f":"0","v":0},{"$f":"ROUND(MAX(O167:P167,Misc!C30),3)","v":0},{"$f":"ROUND(Misc!D30,0)","v":0},{"$f":"Misc!E30","v":0},{"$f":"Misc!G30","v":0},null,{"$f":"Misc!H30","v":0},null,null,4,{"$f":"IF(Misc!J30=\"\",\"\",Misc!J30=\"\")","v":""}]
[null,null,null,null,null,null,null,null,"Steam Trap Repair or Replacement",3,{"$f":"INDEX('Savings Summary'!$Q$8:$Q$51,MATCH('DSMT Export'!I168,'Savings Summary'!$C$8:$C$51,0))","v":0},{"$f":"INDEX('Savings Summary'!$R$8:$R$51,MATCH('DSMT Export'!I168,'Savings Summary'!$C$8:$C$51,0))","v":0},0,0,{"$f":"ROUND(Misc!B31,3)","v":0},{"$f":"0","v":0},{"$f":"ROUND(MAX(O168:P168,Misc!C31),3)","v":0},{"$f":"ROUND(Misc!D31,0)","v":0},{"$f":"Misc!E31","v":0},{"$f":"Misc!G31","v":0},null,{"$f":"Misc!H31","v":0},null,null,4,{"$f":"IF(Misc!J31=\"\",\"\",Misc!J31=\"\")","v":""}]
[null,null,null,null,null,null,null,null,"Hand Dryers",1,{"$f":"INDEX('Savings Summary'!$Q$8:$Q$51,MATCH('DSMT Export'!I169,'Savings Summary'!$C$8:$C$51,0))","v":0},{"$f":"INDEX('Savings Summary'!$R$8:$R$51,MATCH('DSMT Export'!I169,'Savings Summary'!$C$8:$C$51,0))","v":0},0,0,{"$f":"ROUND(Misc!B35,3)","v":0},{"$f":"0","v":0},{"$f":"ROUND(Misc!C35,3)","v":0},{"$f":"ROUND(Misc!D35,0)","v":0},{"$f":"Misc!E35","v":0},{"$f":"Misc!F35","v":0},{"$f":"Misc!G35","v":0},null,null,null,4,{"$f":"Misc!H35","v":0}]
[null,null,null,null,null,null,null,null,"Hand Dryers",2,{"$f":"INDEX('Savings Summary'!$Q$8:$Q$51,MATCH('DSMT Export'!I170,'Savings Summary'!$C$8:$C$51,0))","v":0},{"$f":"INDEX('Savings Summary'!$R$8:$R$51,MATCH('DSMT Export'!I170,'Savings Summary'!$C$8:$C$51,0))","v":0},0,0,{"$f":"ROUND(Misc!B36,3)","v":0},{"$f":"0","v":0},{"$f":"ROUND(Misc!C36,3)","v":0},{"$f":"ROUND(Misc!D36,0)","v":0},{"$f":"Misc!E36","v":0},{"$f":"Misc!F36","v":0},{"$f":"Misc!G36","v":0},null,null,null,4,{"$f":"Misc!H36","v":0}]
[null,null,null,null,null,null,null,null,"Hand Dryers",3,{"$f":"INDEX('Savings Summary'!$Q$8:$Q$51,MATCH('DSMT Export'!I171,'Savings Summary'!$C$8:$C$51,0))","v":0},{"$f":"INDEX('Savings Summary'!$R$8:$R$51,MATCH('DSMT Export'!I171,'Savings Summary'!$C$8:$C$51,0))","v":0},0,0,{"$f":"ROUND(Misc!B37,3)","v":0},{"$f":"0","v":0},{"$f":"ROUND(Misc!C37,3)","v":0},{"$f":"ROUND(Misc!D37,0)","v":0},{"$f":"Misc!E37","v":0},{"$f":"Misc!F37","v":0},{"$f":"Misc!G37","v":0},null,null,null,4,{"$f":"Misc!H37","v":0}]

{"sheet":"Measure_Line_Item__c","index":10,"n_rows":0,"n_cols":0,"rows_kept":0,"cut":false,"hidden":true,"merged":[]}

{"sheet":"Lookup tables","index":11,"n_rows":880,"n_cols":63,"rows_kept":880,"cut":false,"hidden":true,"merged":[[439,7,439,9],[225,1,226,1],[225,6,225,11],[686,28,686,31],[423,1,424,1],[466,10,466,15],[686,24,686,27],[338,16,338,27],[393,1,394,1],[233,1,234,1],[242,1,243,1],[269,1,270,1],[299,1,300,1],[439,4,439,6],[526,14,526,15],[686,20,686,23],[526,17,526,18],[447,1,448,1],[696,1,697,1],[525,1,526,1],[685,1,686,1],[686,8,686,11],[686,12,686,15],[686,16,686,19],[466,4,466,9],[182,2,183,2],[11,1,12,1],[22,1,23,1],[33,1,34,1],[172,1,175,1],[130,1,131,1],[43,1,44,1],[62,1,63,1],[180,2,181,2],[124,1,125,1],[1,1,2,1],[724,1,725,1],[737,1,738,1],[705,1,706,1],[433,1,434,1],[214,1,215,1],[220,1,221,1],[538,1,539,1],[190,1,191,1],[515,1,516,1],[438,1,439,1],[364,1,365,1],[293,1,294,1],[338,1,339,1],[865,1,866,1],[184,2,185,2],[790,1,791,1],[781,1,782,1],[811,1,812,1],[765,1,766,1],[744,1,745,1],[755,1,756,1],[186,2,187,2]]}
[]
[null,"Door Gaskets",null,null,"kWh","kW","NCP kW"]
[null,null,null,"Low Temperature",26.5,3.0000000000000001E-3,0]
[null,null,null,"Medium Temperature",3.5,4.0000000000000002E-4,0]
[null,null,null,"CPS Low Temperature",115,6.7600000000000004E-3,6.8900000000000003E-3]
[null,null,null,"CPS Medium Temperature",15,1.2899999999999999E-3,1.32E-3]
[]
[]
[null,"CPS NCF for Refrigeration Measures:",1]
[null,"CPS CF for Refrigeration Measures:",0.98099999999999998]
[]
[null,"Night Covers for Open Vertical and Horizontal Refrigerated Display Cases",null,"Display Case","NCkW savings","kWh/ft savings",null,"Condensing Unit Config","Display Case Orientation","Display Case Temp"]
[null,null,null,"Medium TemperatureRemote CondensingVertical",2.3E-2,130.77000000000001,null,"Remote Condensing","Vertical","Low Temperature"]
[null,null,null,"Medium TemperatureRemote CondensingHorizontal",2.3E-2,39.51,null,"Self-Contained","Horizontal","Medium Temperature"]
[null,null,null,"Medium TemperatureSelf-ContainedVertical",1.2E-2,252]
[null,null,null,"Medium TemperatureSelf-ContainedHorizontal",1.2E-2,121.5]
[null,null,null,"Low TemperatureRemote CondensingVertical",1.7000000000000001E-2,296.27999999999997]
[null,null,null,"Low TemperatureRemote CondensingHorizontal",1.7000000000000001E-2,90.63]
[null,null,null,"Low TemperatureSelf-ContainedHorizontal",8.0000000000000002E-3,247.32]
[]
[]
[]
[null,"ECM Evaporator Fan Motors for Refrigerated Display Cases",null,"Representative Climate Region","Medium Temp","Low Temp","DF","Controls","%Off",null,null,"Hours",null,"Motor Eff. & Power Table"]
[null,null,null,null,"COP","COP",null,"Yes",0.46,null,null,8760,null,"Nominal Motor Size","Motor Output (W)","Shaded Pole","PSC","ECM Input (W)"]
[null,null,null,null,null,null,null,"No",0,null,null,null,null,"(1-14W)",9,30,15,13]
[null,null,null,"TX1",1.94,2.5099999999999998,1,null,null,null,null,null,null,"1/40 HP (16-23W)",19.5,65,33,28]
[null,null,null,"TX2",2.0299999999999998,2.63,1,null,null,null,"Refrigeration Type","DC",null,"1/20 HP (37W)",37,123,62,53]
[null,null,null,"TX3",1.91,2.4700000000000002,1,null,null,null,"Medium Temperature",1,null,"1/15 HP (49W)",49,163,82,70]
[null,null,null,"TX4",1.89,2.44,1,null,null,null,"Low Temperature",0.94399999999999995,null,"1/4 HP",186.5,622,311,266]
[null,null,null,"TX5",2.02,2.62,1,null,null,null,null,null,null,"1/3 HP",248.7,829,415,355]
[null,null,null,"TXCPS",1.8,1.39,0.98099999999999998]
[]
[]
[null,"Door Heater Controls for Refrigerated Display Cases ",null,"Location","Med-Temperature",null,null,"Low-Temperature"]
[null,null,null,null,"kWh/ft","kW/ft","NCP kW/ft","kWh/ft","kW/ft","NCP kW/ft"]
[null,null,null,"TX1",342,4.7E-2,null,610,8.1000000000000003E-2]
[null,null,null,"TX2",232,4.7E-2,null,413,8.1000000000000003E-2]
[null,null,null,"TX5",170,4.7E-2,null,304,8.1000000000000003E-2]
[null,null,null,"TX3",131,4.7E-2,null,234,8.1000000000000003E-2]
[null,null,null,"TX4",380,4.7E-2,null,682,8.1000000000000003E-2]
[null,null,null,"TXCPS",150,2E-3,2E-3,267,3.5000000000000001E-3,3.5999999999999999E-3]
[]
[]
[null,"Solid & Glass Door Reach-In Refrigerators and Freezers",null,null,"Volume (min of range)","Energy Savings","Demand Savings"]
[null,null,null,"RefrigeratorSolid0 < V < 15 ",0,16,2E-3]
[null,null,null,"RefrigeratorSolid15 ≤ V < 30",15,892,0.10199999999999999]
[null,"Refrigerator",null,"RefrigeratorSolid30 ≤ V < 50",30,1256,0.14299999999999999]
[null,"Freezer",null,"RefrigeratorSolidV ≥ 50",50,1919,0.219]
[null,null,null,"RefrigeratorGlass0 < V < 15 ",0,1137,0.13]
[null,"Glass",null,"RefrigeratorGlass15 ≤ V < 30",15,1355,0.155]
[null,"Solid",null,"RefrigeratorGlass30 ≤ V < 50",30,1782,0.20300000000000001]
[null,null,null,"RefrigeratorGlassV ≥ 50",50,2002,0.22900000000000001]
[null,"0 < V < 15 ",null,"FreezerSolid0 < V < 15 ",0,713,8.1000000000000003E-2]
[null,"15 ≤ V < 30",null,"FreezerSolid15 ≤ V < 30",15,1726,0.19700000000000001]
[null,"30 ≤ V < 50",null,"FreezerSolid30 ≤ V < 50",30,3301,0.377]
[null,"V ≥ 50",null,"FreezerSolidV ≥ 50",50,5177,0.59099999999999997]
[null,null,null,"FreezerGlass0 < V < 15 ",0,1766,0.20200000000000001]
[null,null,null,"FreezerGlass15 ≤ V < 30",15,4321,0.49299999999999999]
[null,null,null,"FreezerGlass30 ≤ V < 50",30,8630,0.98499999999999999]
[null,null,null,"FreezerGlassV ≥ 50",50,13093,1.4950000000000001]
[]
[]
[null,"Zero-Energy Doors for Refrigerated Cases",null,null,"Peak kW","NC kW","kWh"]
[null,null,null,"TX1Medium Temperature",0.13,null,1139]
[null,null,null,"TX2Medium Temperature",0.13100000000000001,null,1148]
[null,null,null,"TX3Medium Temperature",0.13,null,1136]
[null,null,null,"TX4Medium Temperature",0.129,null,1134]
[null,null,null,"TX5Medium Temperature",0.13100000000000001,null,1147]
[null,null,null,"TXCPSMedium Temperature",0.128,0.13100000000000001,1140]
[null,null,null,"TX1Low Temperature",0.23899999999999999,null,2092]
[null,null,null,"TX2Low Temperature",0.24099999999999999,null,2111]
[null,null,null,"TX3Low Temperature",0.23799999999999999,null,2084]
[null,null,null,"TX4Low Temperature",0.23699999999999999,null,2080]
[null,null,null,"TX5Low Temperature",0.24099999999999999,null,2109]
[null,null,null,"TXCPSLow Temperature",0.23499999999999999,0.23899999999999999,2095]
[]
[null,"Evaporator Fan Controls ",null,null,"DCevap","BF"]
[null,null,null,"Low Temperature",0.94399999999999995,1.5]
[null,null,null,"Medium Temperature",1,1.3]
[null,null,null,"High Temperature",1,1.2]
[]
[]
[]
[null,"Electronic Defrost Control",null,"Representative Climate Region","Medium Temperature","Low Temperature","CF"]
[null,null,null,null,"EffMT","EffLT"]
[null,null,null,null,"(kW/Ton)","(kW/Ton)"]
[null,null,null,"TX1",1.94,2.5099999999999998,1]
[null,null,null,"TX2",2.0299999999999998,2.63,1]
[null,null,null,"TX5",1.91,2.4700000000000002,1]
[null,null,null,"TX3",1.89,2.44,1]
[null,null,null,"TX4",2.02,2.62,1]
[null,null,null,"TXCPS",1.95,2.5299999999999998,0.98099999999999998]
[]
[null,"Strip Curtains",null,"Building & Refrigeration type","Peak kW","NC kW","kWh"]
[null,null,null,"RestaurantMedium Temperature",4.0000000000000001E-3,4.0000000000000001E-3,22.5]
[null,null,null,"RestaurantLow Temperature",2.1000000000000001E-2,2.1000000000000001E-2,114.01]
[null,null,null,"Convenience StoreMedium Temperature",3.0000000000000001E-3,3.0000000000000001E-3,23.58]
[null,"Restaurant",null,"Convenience StoreLow Temperature",5.0000000000000001E-3,5.0000000000000001E-3,33.15]
[null,"Convenience Store",null,"GroceryMedium Temperature",1.7999999999999999E-2,1.7999999999999999E-2,119.88]
[null,"Grocery",null,"GroceryLow Temperature",7.5999999999999998E-2,7.5999999999999998E-2,494.32]
[null,"Refrigerated Warehouse",null,"Refrigerated WarehouseMedium Temperature",6.0999999999999999E-2,6.0999999999999999E-2,153.36000000000001]
[null,null,null,"Refrigerated WarehouseLow Temperature",0,0,0]
[null,null,null,null,null,"*Currently using NC kW = Peak kW"]
[null,"High Speed Doors for Cold Storage",null,"Energy Factor"]
[null,null,null,"Conditioned Space?","Cold Room Temp:","-20°F","0°F","20°F","40°F"]
[null,null,null,"Yes","All Zones",783056,518199,322435,230311]
[null,null,null,"No","TX1",849911,576602,1025489,122795]
[null,null,null,null,"TX2",1025489,719712,432092,209695]
[null,null,null,null,"TX3",1179743,837151,562418,420336]
[null,null,null,null,"TX4",1240984,887904,603598,464913]
[null,null,null,null,"TX5",902050,614930,343300,142285]
[null,null,null,null,"TXCPS",1179743,837151,562418,420336]
[]
[null,null,null,"Demand Factor"]
[null,null,null,"Conditioned Space?","Cold Room Temp:","-20°F","0°F","20°F","40°F"]
[null,null,null,"Yes","All Zones",1,1,1,1]
[null,null,null,"No","TX1",278.94,208.2,141.49,90.96]
[null,null,null,null,"TX2",293.08999999999997,218.3,153.62,101.07]
[null,null,null,null,"TX3",293.08999999999997,218.3,153.62,101.07]
[null,null,null,null,"TX4",264.79000000000002,192.03,131.38999999999999,76.81]
[null,null,null,null,"TX5",278.94,208.2,141.49,90.96]
[null,null,"*Used zone 3 for CPS",null,"TXCPS",293.08999999999997,218.3,153.62,101.07]
[]
[]
[null,"High Efficiency Electric Convection Oven",null,"Oven Size","Annual Energy Savings [kWh]","Peak Demand Savings [kW]","NC Demand Savings [kW]"]
[null,null,null,"Full-Size >= 5 pans",3043,0.61199999999999999,{"$f":"F126","v":0.61199999999999999}]
[null,null,null,"Full-Size < 5 pans",4633,0.93899999999999995,0.93899999999999995]
[null,null,null,"Half-Size",244,3.5999999999999997E-2,{"$f":"F128","v":3.5999999999999997E-2}]
[]
[]
[null,"High Efficiency Electric Combination Oven",null,"Pan Capacity","Annual Energy Savings [kWh]","Peak Demand Savings [kW]","NC Demand Savings [kW]"]
[null,null,null,3,1080,0.125,{"$f":"F132","v":0.125}]
[null,null,null,4,843,7.3999999999999996E-2,{"$f":"F133","v":7.3999999999999996E-2}]
[null,null,null,5,4338,0.78900000000000003,0.78900000000000003]
[null,null,null,6,4999,0.92300000000000004,0.92300000000000004]
[null,null,null,7,5677,1.06,1.06]
[null,null,null,8,6370,1.2,1.2]
[null,null,null,9,7079,1.343,1.343]
[null,null,null,10,7804,1.49,1.49]
[null,null,null,11,8545,1.64,1.64]
[null,null,null,12,9303,1.796,1.796]
[null,null,null,13,10076,1.95,1.95]
[null,null,null,14,10865,2.11,2.11]
[null,null,null,15,11670,2.2730000000000001,2.2730000000000001]
[null,null,null,16,12492,2.4390000000000001,2.4390000000000001]
[null,null,null,17,13329,2.609,2.609]
[null,null,null,18,14182,2.782,2.782]
[null,null,null,19,15051,2.9580000000000002,2.9580000000000002]
[null,null,null,20,15937,3.1379999999999999,3.1379999999999999]
[null,null,null,21,16838,3.32,3.32]
[null,null,null,22,17755,3.5070000000000001,3.5070000000000001]
[null,null,null,23,18689,3.6960000000000002,3.6960000000000002]
[null,null,null,24,19638,3.8889999999999998,3.8889999999999998]
[null,null,null,25,20603,4.085,4.085]
[null,null,null,26,21585,4.2839999999999998,4.2839999999999998]
[null,null,null,27,22582,4.4870000000000001,4.4870000000000001]
[null,null,null,28,23595,4.6929999999999996,4.6929999999999996]
[null,null,null,29,24625,4.9020000000000001,4.9020000000000001]
[null,null,null,30,25670,5.1139999999999999,5.1139999999999999]
[null,null,null,31,26732,5.33,5.33]
[null,null,null,32,27809,5.5490000000000004,5.5490000000000004]
[null,null,null,33,28902,5.7709999999999999,5.7709999999999999]
[null,null,null,34,31012,5.9969999999999999,5.9969999999999999]
[null,null,null,35,31137,6.226,6.226]
[null,null,null,36,32279,6.4580000000000002,6.4580000000000002]
[null,null,null,37,33436,6.6929999999999996,6.6929999999999996]
[null,null,null,38,34609,6.9320000000000004,6.9320000000000004]
[null,null,null,39,35799,7.1740000000000004,7.1740000000000004]
[null,null,null,40,37004,7.42,7.42]
[]
[]
[]
[null,"ENERGY STAR Commercial Dishwashers",null,"Facility Description","Under Counter","Under Counter","Under Counter","Stationary single-tank door","Stationary single-tank door","Stationary single-tank door","Single Tank Conveyor","Single Tank Conveyor","Single Tank Conveyor","Multi Tank Conveyor","Multi Tank Conveyor","Multi Tank Conveyor","Pot, Pan and Utensil","Pot, Pan and Utensil","Pot, Pan and Utensil",null,"Type","Measure Life"]
[null,null,null,null,"kWh","Peak kW","NC kW","kWh","Peak kW","NC kW","kWh","Peak kW","NC kW","kWh","Peak kW","NC kW","kWh","Peak kW","NC kW",null,"Under Counter",10]
[null,null,null,null,{"$f":"E173&E174","v":"Under CounterkWh"},{"$f":"F173&F174","v":"Under CounterPeak kW"},{"$f":"G173&G174","v":"Under CounterNC kW"},"Stationary single-tank doorkWh","Stationary single-tank doorPeak kW",{"$f":"J173&J174","v":"Stationary single-tank doorNC kW"},"Single Tank ConveyorkWh","Single Tank ConveyorPeak kW",{"$f":"M173&M174","v":"Single Tank ConveyorNC kW"},"Multi Tank ConveyorkWh","Multi Tank ConveyorPeak kW",{"$f":"P173&P174","v":"Multi Tank ConveyorNC kW"},"Pot, Pan and UtensilkWh","Pot, Pan and UtensilPeak kW",{"$f":"S173&S174","v":"Pot, Pan and UtensilNC kW"},null,"Stationary single-tank door",15]
[null,null,null,"Low Temp. / Electric Hot Water Heater",3955,{"$f":"INDEX(F$181:F$182,MATCH(TRM,$D$181:$D$182,0))","v":0.54200000000000004},{"$f":"INDEX(G$181:G$182,MATCH(TRM,$D$181:$D$182,0))","v":0},17362,{"$f":"INDEX(I$181:I$182,MATCH(TRM,$D$181:$D$182,0))","v":2.3780000000000001},{"$f":"INDEX(J$181:J$182,MATCH(TRM,$D$181:$D$182,0))","v":0},17426,{"$f":"INDEX(L$181:L$182,MATCH(TRM,$D$181:$D$182,0))","v":2.387},{"$f":"INDEX(M$181:M$182,MATCH(TRM,$D$181:$D$182,0))","v":0},24292,{"$f":"INDEX(O$181:O$182,MATCH(TRM,$D$181:$D$182,0))","v":3.3279999999999998},{"$f":"INDEX(P$181:P$182,MATCH(TRM,$D$181:$D$182,0))","v":0},0,{"$f":"INDEX(R$181:R$182,MATCH(TRM,$D$181:$D$182,0))","v":0},{"$f":"INDEX(S$181:S$182,MATCH(TRM,$D$181:$D$182,0))","v":0},null,"Single Tank Conveyor",20]
[null,null,null,"High Temp. / Electric Hot Water Heater w/ Electric Booster Heater",4303,{"$f":"INDEX(F$183:F$184,MATCH(TRM,$D$181:$D$182,0))","v":0.58899999999999997},{"$f":"INDEX(G$183:G$184,MATCH(TRM,$D$181:$D$182,0))","v":0},12596,{"$f":"INDEX(I$183:I$184,MATCH(TRM,$D$181:$D$182,0))","v":1.726},{"$f":"INDEX(J$183:J$184,MATCH(TRM,$D$181:$D$182,0))","v":0},10966,{"$f":"INDEX(L$183:L$184,MATCH(TRM,$D$181:$D$182,0))","v":1.502},{"$f":"INDEX(M$183:M$184,MATCH(TRM,$D$181:$D$182,0))","v":0},29751,{"$f":"INDEX(O$183:O$184,MATCH(TRM,$D$181:$D$182,0))","v":4.0750000000000002},{"$f":"INDEX(P$183:P$184,MATCH(TRM,$D$181:$D$182,0))","v":0},3750,{"$f":"INDEX(R$183:R$184,MATCH(TRM,$D$181:$D$182,0))","v":0.51400000000000001},{"$f":"INDEX(S$183:S$184,MATCH(TRM,$D$181:$D$182,0))","v":0},null,"Multi Tank Conveyor",20]
[null,null,null,"High Temp. / Gas Hot Water Heater w/ Electric Booster Heater",3221,{"$f":"INDEX(F$185:F$186,MATCH(TRM,$D$181:$D$182,0))","v":0.441},{"$f":"INDEX(G$185:G$186,MATCH(TRM,$D$181:$D$182,0))","v":0},5572,{"$f":"INDEX(I$185:I$186,MATCH(TRM,$D$181:$D$182,0))","v":0.76300000000000001},{"$f":"INDEX(J$185:J$186,MATCH(TRM,$D$181:$D$182,0))","v":0},6700,{"$f":"INDEX(L$185:L$186,MATCH(TRM,$D$181:$D$182,0))","v":0.91800000000000004},{"$f":"INDEX(M$185:M$186,MATCH(TRM,$D$181:$D$182,0))","v":0},13569,{"$f":"INDEX(O$185:O$186,MATCH(TRM,$D$181:$D$182,0))","v":1.859},{"$f":"INDEX(P$185:P$186,MATCH(TRM,$D$181:$D$182,0))","v":0},1642,{"$f":"INDEX(R$185:R$186,MATCH(TRM,$D$181:$D$182,0))","v":0.22500000000000001},{"$f":"INDEX(S$185:S$186,MATCH(TRM,$D$181:$D$182,0))","v":0},null,"Pot, Pan and Utensil",10]
[null,null,null,"High Temp. / Electric Hot Water Heater w/ Gas Booster Heater",3684,{"$f":"INDEX(F$187:F$188,MATCH(TRM,$D$181:$D$182,0))","v":0.505},{"$f":"INDEX(G$187:G$188,MATCH(TRM,$D$181:$D$182,0))","v":0},8582,{"$f":"INDEX(I$187:I$188,MATCH(TRM,$D$181:$D$182,0))","v":1.1759999999999999},{"$f":"INDEX(J$187:J$188,MATCH(TRM,$D$181:$D$182,0))","v":0},8528,{"$f":"INDEX(L$187:L$188,MATCH(TRM,$D$181:$D$182,0))","v":1.1679999999999999},{"$f":"INDEX(M$187:M$188,MATCH(TRM,$D$181:$D$182,0))","v":0},20504,{"$f":"INDEX(O$187:O$188,MATCH(TRM,$D$181:$D$182,0))","v":2.8090000000000002},{"$f":"INDEX(P$187:P$188,MATCH(TRM,$D$181:$D$182,0))","v":0},2545,{"$f":"INDEX(R$187:R$188,MATCH(TRM,$D$181:$D$182,0))","v":0.34899999999999998},{"$f":"INDEX(S$187:S$188,MATCH(TRM,$D$181:$D$182,0))","v":0}]
[]
[null,null,"Low Temp. / Electric Hot Water Heater","TX",null,0.54200000000000004,0,null,2.3780000000000001,0,null,2.387,0,null,3.3279999999999998,0,null,0,0]
[null,null,null,"CPS",null,0.29199999999999998,0.38700000000000001,null,1.8560000000000001,2.4590000000000001,null,1.5660000000000001,2.0739999999999998,null,2.1619999999999999,2.863,null,0,0]
[null,null,"High Temp. / Electric Hot Water Heater w/ Electric Booster Heater","TX",null,0.58899999999999997,0,null,1.726,0,null,1.502,0,null,4.0750000000000002,0,null,0.51400000000000001,0]
[null,null,null,"CPS",null,0.36399999999999999,0.48299999999999998,null,1.363,1.806,null,1.0589999999999999,1.4019999999999999,null,3.15,4.1719999999999997,null,0.38,0.504]
[null,null,"High Temp. / Gas Hot Water Heater w/ Electric Booster Heater","TX",null,0.441,0,null,0.76300000000000001,0,null,0.91800000000000004,0,null,1.859,0,null,0.22500000000000001,0]
[null,null,null,"CPS",null,0.24,0.318,null,0.55600000000000005,0.73699999999999999,null,0.56899999999999995,0.753,null,1.2909999999999999,1.7090000000000001,null,0.13800000000000001,0.183]
[null,null,"High Temp. / Electric Hot Water Heater w/ Electric Booster Heater","TX",null,0.505,0,null,1.1759999999999999,0,null,1.1679999999999999,0,null,2.8090000000000002,0,null,0.34899999999999998,0]
[null,null,null,"CPS",null,0.505,0.505,null,1.1759999999999999,1.1759999999999999,null,1.1679999999999999,1.1679999999999999,null,2.8090000000000002,2.8090000000000002,null,0.34899999999999998,0.34899999999999998]
[]
[]
[null,"ENERGY STAR Electric Steam Cookers",null,"Boiler Based","3-Pan"]
[null,null,null,"Steam Generator","4-Pan"]
[null,null,null,null,"5-Pan"]
[null,null,null,null,"6-Pan or larger"]
[]
[null,null,null,"Lookup","kWh","Peak kW","NC kW"]
[null,null,null,"TXBoiler Based3-Pan",7988,2.4889999999999999]
[null,null,null,"TXBoiler Based4-Pan",9822,3.0630000000000002]
[null,null,null,"TXBoiler Based5-Pan",11614,3.6230000000000002]
[null,null,null,"TXBoiler Based6-Pan or larger",13408,4.1849999999999996]
[null,null,null,"TXSteam Generator3-Pan",6715,2.0910000000000002]
[null,null,null,"TXSteam Generator4-Pan",8139,2.536]
[null,null,null,"TXSteam Generator5-Pan",9515,2.9670000000000001]
[null,null,null,"TXSteam Generator6-Pan or larger",10891,3.3969999999999998]
[null,null,null,"CPSBoiler Based3-Pan",11784,2.4910000000000001,2.69]
[null,null,null,"CPSBoiler Based4-Pan",14553,3.077,3.323]
[null,null,null,"CPSBoiler Based5-Pan",17268,3.6509999999999998,3.9420000000000002]
[null,null,null,"CPSBoiler Based6-Pan or larger",19990,4.226,4.5640000000000001]
[null,null,null,"CPSSteam Generator3-Pan",9967,2.1070000000000002,2.2759999999999998]
[null,null,null,"CPSSteam Generator4-Pan",12107,2.56,2.7639999999999998]
[null,null,null,"CPSSteam Generator5-Pan",14186,2.9990000000000001,3.2389999999999999]
[null,null,null,"CPSSteam Generator6-Pan or larger",16270,3.44,3.7149999999999999]
[]
[null,null,null,null,null,null,null,null,"TX","CPS","TX","CPS"]
[null,"ENERGY STAR Commercial Electric Hot Food Holding Cabinet",null,"Size","Annual Energy Savings [kWh]","Peak Demand Savings [kW]","NC Demand Savings [kW]",null,"Peak Demand Savings [kW]",null,"NC Demand Savings [kW]"]
[null,null,null,"0 < V < 13",223,{"$f":"INDEX(I216:J216,1,MATCH(TRM,$I$214:$J$214,0))","v":6.0999999999999999E-2},{"$f":"INDEX(K216:L216,1,MATCH(TRM,$I$214:$J$214,0))","v":0},null,6.0999999999999999E-2,0.20499999999999999,0,0.222]
[null,null,null,"13 ≤ V < 28",1189,{"$f":"INDEX(I217:J217,1,MATCH(TRM,$I$214:$J$214,0))","v":0.32600000000000001},{"$f":"INDEX(K217:L217,1,MATCH(TRM,$I$214:$J$214,0))","v":0},null,0.32600000000000001,0.46800000000000003,0,0.50600000000000001]
[null,null,null,"28 ≤ V",3893,{"$f":"INDEX(I218:J218,1,MATCH(TRM,$I$214:$J$214,0))","v":1.0669999999999999},{"$f":"INDEX(K218:L218,1,MATCH(TRM,$I$214:$J$214,0))","v":0},null,1.0669999999999999,0.81699999999999995,0,0.88300000000000001]
[]
[null,null,null,null,null,null,null,null,"TX","CPS","TX","CPS"]
[null,"ENERGY STAR Electric Fryer",null,"Fryer Type","Annual Energy Savings [kWh]","Peak Demand Savings [kW]","NC Demand Savings [kW]",null,"Peak Demand Savings [kW]",null,"NC Demand Savings [kW]"]
[null,null,null,"Standard",3272,{"$f":"INDEX(I222:J222,1,MATCH(TRM,$I$220:$J$220,0))","v":0.47599999999999998},{"$f":"INDEX(K222:L222,1,MATCH(TRM,$K$220:$L$220,0))","v":0},null,0.47599999999999998,0.377,0,0.40699999999999997]
[null,null,null,"Large Vat",2696,{"$f":"INDEX(I223:J223,1,MATCH(TRM,$I$220:$J$220,0))","v":0.51600000000000001},{"$f":"INDEX(K223:L223,1,MATCH(TRM,$K$220:$L$220,0))","v":0},null,0.51600000000000001,0.53600000000000003,0,0.57899999999999996]
[]
[]
[null,"Vending Machine Controls",null,null,null,null,"Peak Demand Savings"]
[null,null,null,"Type of Machine","Annual (kWh) Savings","NC Demand Savings [kW]","TX1","TX2","TX3","TX4","TX5","TXCPS"]
[null,null,null,"Refrigerated Cold Drink Unit (cans or bottles)",1612,0.42299999999999999,0.06,6.3E-2,0.06,6.4000000000000001E-2,6.8000000000000005E-2,4.2000000000000003E-2]
[null,null,null,"Refrigerated Reach-in Unit",1086,0.28499999999999998,6.9000000000000006E-2,7.2999999999999995E-2,6.8000000000000005E-2,7.3999999999999996E-2,7.8E-2,2.9000000000000001E-2]
[null,null,null,"Non-Refrigerated Snack Unit",387,0.10199999999999999,1.2999999999999999E-2,1.2999999999999999E-2,1.2999999999999999E-2,1.4E-2,1.4E-2,0.01]
[]
[]
[null,null,null,null,null,null,"Hourly Peak Demand (P)"]
[null,"Low Flow Pre-Rinse Spray Valve Electric and Gas (direct install/point of sale)",null,"Building Type","Use Duration (U) [min/day/unit]","Days/yr","TX1","TX2","TX3","TX4","TX5","TXCPS",null,"Product Class","Base Flowrate (GPM)"]
[null,null,null,"Fast Food Restaurant",45,360,6.298,5.85,6.2370000000000001,6.2140000000000004,5.66,{"$f":"I235","v":6.2370000000000001},null,"Class 1 (≤5 Ounce-force)",1]
[null,null,null,"Casual Dining",105,360,3.1509999999999998,4.7670000000000003,3.544,3.0920000000000001,6.8049999999999997,{"$f":"I236","v":3.544},null,"Class 2 (>5 and ≤8 Ounce-force)",1.2]
[null,null,null,"Institutional",210,360,2.5369999999999999,2.63,2.6269999999999998,2.7679999999999998,3.9340000000000002,2.6269999999999998,null,"Class 3(>8 Ounce-force)",1.28]
[null,null,null,"Dormitory",210,270,2.5369999999999999,2.63,2.6269999999999998,2.7679999999999998,3.9340000000000002,2.6269999999999998]
[null,null,null,"School",105,193,2.5369999999999999,2.63,2.6269999999999998,2.7679999999999998,3.9340000000000002,2.6269999999999998]
[]
[]
[]
[null,"DCV Kitchen Ventilation",null,"Lookup","Savings/HP w/ MAU","Savings/HP w/o MAU","Wntr Dmnd Savings/HP w/ MAU","Wntr Dmnd Savings/HP w/o MAU","Sumr Dmnd Savings/HP w/ MAU","Sumr Dmnd Savings/HP w/o MAU"]
[null,null,null,"TX1Casual Dining/Fast Food",4253,2990,0.62,0.44,0.56999999999999995,0.4]
[null,null,null,"TX124-Hr Restaurant/Hotel",6376,4418,0.93,0.65,0.85,0.59]
[null,null,null,"TX1School Cafe with summer",2480,1498,0.36,0.22,0.33,0.2]
[null,"Casual Dining/Fast Food",null,"TX1School Cafe without summer",1779,1016,0.26,0.15,0.24,0.14000000000000001]
[null,"24-Hr Restaurant/Hotel",null,"TX2Casual Dining/Fast Food",4768,3504,0.69,0.51,0.65,0.48]
[null,"School Cafe with summer",null,"TX224-Hr Restaurant/Hotel",7282,5324,1.05,0.77,0.99,0.72]
[null,"School Cafe without summer",null,"TX2School Cafe with summer",2864,1881,0.41,0.27,0.39,0.26]
[null,null,null,"TX2School Cafe without summer",1981,1218,0.28999999999999998,0.18,0.27,0.17]
[null,null,null,"TX3Casual Dining/Fast Food",4836,3572,0.69,0.51,0.65,0.48]
[null,null,null,"TX324-Hr Restaurant/Hotel",7368,5410,1.05,0.77,0.99,0.72]
[null,null,null,"TX3School Cafe with summer",2985,2002,0.43,0.28999999999999998,0.4,0.27]
[null,null,null,"TX3School Cafe without summer",2144,1381,0.31,0.2,0.28999999999999998,0.18]
[null,null,null,"TX4Casual Dining/Fast Food",5038,3775,0.73,0.55000000000000004,0.66,0.5]
[null,null,null,"TX424-Hr Restaurant/Hotel",7787,5829,1.1299999999999999,0.85,1.02,0.76]
[null,null,null,"TX4School Cafe with summer",3144,2162,0.46,0.31,0.41,0.28000000000000003]
[null,null,null,"TX4School Cafe without summer",2261,1499,0.33,0.22,0.3,0.2]
[null,null,null,"TX5Casual Dining/Fast Food",4668,3404,0.68,0.5,0.68,0.49]
[null,null,null,"TX524-Hr Restaurant/Hotel",7034,5077,1.03,0.74,1.02,0.74]
[null,null,null,"TX5School Cafe with summer",2801,1818,0.41,0.27,0.41,0.26]
[null,null,null,"TX5School Cafe without summer",2023,1260,0.3,0.18,0.28999999999999998,0.18]
[null,"Used TX3 for CPS",null,"TXCPSCasual Dining/Fast Food",{"$f":"E252","v":4836},{"$f":"F252","v":3572},0,0,0.65,0.48]
[null,null,null,"TXCPS24-Hr Restaurant/Hotel",{"$f":"E253","v":7368},5410,0,0,0.99,0.72]
[null,null,null,"TXCPSSchool Cafe with summer",{"$f":"E254","v":2985},2002,0,0,0.4,0.27]
[null,null,null,"TXCPSSchool Cafe without summer",{"$f":"E255","v":2144},1381,0,0,0.28999999999999998,0.18]
[]
[]
[null,"Commercial Ice Makers",null,"Equipment Type","Operation","Harvest Rate (lbs/24 hrs, max of range)","Base Energy Use Const","Base Energy Use Multiplier"]
[null,null,null,"Ice Making Head","Batch",300,10,-1.2330000000000001E-2]
[null,null,null,"Ice Making Head","Batch",800,7.05,-2.5000000000000001E-3]
[null,null,null,"Ice Making Head","Batch",1500,5.55,-6.3000000000000003E-4]
[null,"Ice Making Head",null,"Ice Making Head","Batch",4000,4.6100000000000003,0]
[null,"Remote Cond. Unit (but not Remote Comp.)",null,"Remote Cond. Unit (but not Remote Comp.)","Batch",988,7.97,-3.4199999999999999E-3]
[null,"Remote Cond. Unit and Comp.",null,"Remote Cond. Unit (but not Remote Comp.)","Batch",4000,4.59,0]
[null,"Self Contained Unit",null,"Remote Cond. Unit and Comp.","Batch",930,7.97,-3.4199999999999999E-3]
[null,null,null,"Remote Cond. Unit and Comp.","Batch",4000,4.79,0]
[null,null,null,"Self Contained Unit","Batch",110,14.79,-4.6899999999999997E-2]
[null,null,null,"Self Contained Unit","Batch",200,12.42,-2.5329999999999998E-2]
[null,null,null,"Self Contained Unit","Batch",4000,7.35,0]
[null,null,null,"Ice Making Head","Continuous",310,9.19,-6.2899999999999996E-3]
[null,null,null,"Ice Making Head","Continuous",820,8.23,-3.2000000000000002E-3]
[null,null,null,"Ice Making Head","Continuous",4000,5.61,0]
[null,null,null,"Remote Cond. Unit (but not Remote Comp.)","Continuous",800,9.6999999999999993,-5.7999999999999996E-3]
[null,null,null,"Remote Cond. Unit (but not Remote Comp.)","Continuous",4000,5.0599999999999996,0]
[null,null,null,"Remote Cond. Unit and Comp.","Continuous",800,9.9,-5.7999999999999996E-3]
[null,null,null,"Remote Cond. Unit and Comp.","Continuous",4000,5.26,0]
[null,null,null,"Self Contained Unit","Continuous",200,14.22,-0.03]
[null,null,null,"Self Contained Unit","Continuous",700,9.4700000000000006,-6.1999999999999998E-3]
[null,null,null,"Self Contained Unit","Continuous",4000,5.0999999999999996,0]
[]
[]
[null,"Vacuum-Sealing & Packaging Machines",null,"Building Type","kWh/machine","Summer kW/machine","Winter kW/machine"]
[null,null,null,"Supermarkets, Grocery, & Food Stores",1568,0.06,0.06]
[]
[null,null,null,null,null,null,"Savings per motor HP"]
[null,null,null,null,null,null,"Hospital","Healthcare","Nursing Home","Hotel (Common Area)","Large Multifamily (Common Area)","Office - Large","Office - Medium","Office - Small","Education","Convenience Store","Service","Strip Mall","Stand-Alone Retail","Supermarket","Restaurants","Warehouse","Assembly","Worship","Other","Hospital","Healthcare","Nursing Home","Hotel (Common Area)","Large Multifamily (Common Area)","Office - Large","Office - Medium","Office - Small","Education","Convenience Store","Service","Strip Mall","Stand-alone Retail","Supermarket","Restaurants","Warehouse","Assembly","Worship","Other","Hospital","Healthcare","Nursing Home","Hotel (Common Area)","Large Multifamily (Common Area)","Office - Large","Office - Medium","Office - Small","Education","Convenience Store","Service","Strip Mall","Stand-alone Retail","Supermarket","Restaurants","Warehouse","Assembly","Worship","Other"]
[null,null,null,"State & Zone","Application","Pre Control Type","kWh","kWh","kWh","kWh","kWh","kWh","kWh","kWh","kWh","kWh","kWh","kWh","kWh","kWh","kWh","kWh","kWh","kWh","kWh","kW","kW","kW","kW","kW","kW","kW","kW","kW","kW","kW","kW","kW","kW","kW","kW","kW","kW","kW","NCP kW","NCP kW","NCP kW","NCP kW","NCP kW","NCP kW","NCP kW","NCP kW","NCP kW","NCP kW","NCP kW","NCP kW","NCP kW","NCP kW","NCP kW","NCP kW","NCP kW","NCP kW","NCP kW"]
[null,"HVAC VFD's",null,"TX1","AHU Supply Fan","Outlet Damper",1159,1159,1159,1159,1159,724,724,575,632,676,676,676,727,727,994,548,750,750,548,0.04,0.04,0.04,0.04,0.04,0.04,0.04,0.04,0.04,0.04,0.04,0.04,0.04,0.04,0.04,0.04,0.04,0.04,0.04]
[null,null,null,"TX2","AHU Supply Fan","Outlet Damper",1101,1101,1101,1101,1101,682,682,543,596,637,637,637,685,685,941,516,707,707,516,2.3E-2,2.3E-2,2.3E-2,2.3E-2,2.3E-2,2.3E-2,2.3E-2,2.3E-2,2.3E-2,2.3E-2,2.3E-2,2.3E-2,2.3E-2,2.3E-2,2.3E-2,2.3E-2,2.3E-2,2.3E-2,2.3E-2]
[null,null,null,"TX3","AHU Supply Fan","Outlet Damper",1070,1070,1070,1070,1070,658,658,522,576,613,613,613,660,660,912,495,683,683,495,2.1000000000000001E-2,2.1000000000000001E-2,2.1000000000000001E-2,2.1000000000000001E-2,2.1000000000000001E-2,2.1000000000000001E-2,2.1000000000000001E-2,2.1000000000000001E-2,2.1000000000000001E-2,2.1000000000000001E-2,2.1000000000000001E-2,2.1000000000000001E-2,2.1000000000000001E-2,2.1000000000000001E-2,2.1000000000000001E-2,2.1000000000000001E-2,2.1000000000000001E-2,2.1000000000000001E-2,2.1000000000000001E-2]
[null,null,null,"TX4","AHU Supply Fan","Outlet Damper",1046,1046,1046,1046,1046,640,640,506,560,598,598,598,643,643,891,480,667,667,480,6.3E-2,6.3E-2,6.3E-2,6.3E-2,6.3E-2,6.3E-2,6.3E-2,6.3E-2,6.3E-2,6.3E-2,6.3E-2,6.3E-2,6.3E-2,6.3E-2,6.3E-2,6.3E-2,6.3E-2,6.3E-2,6.3E-2]
[null,null,null,"TX5","AHU Supply Fan","Outlet Damper",1121,1121,1121,1121,1121,695,695,552,606,648,648,648,698,698,958,525,720,720,525,4.2000000000000003E-2,4.2000000000000003E-2,4.2000000000000003E-2,4.2000000000000003E-2,4.2000000000000003E-2,4.2000000000000003E-2,4.2000000000000003E-2,4.2000000000000003E-2,4.2000000000000003E-2,4.2000000000000003E-2,4.2000000000000003E-2,4.2000000000000003E-2,4.2000000000000003E-2,4.2000000000000003E-2,4.2000000000000003E-2,4.2000000000000003E-2,4.2000000000000003E-2,4.2000000000000003E-2,4.2000000000000003E-2]
[null,"AHU Supply Fan",null,"TXCPS","AHU Supply Fan","Outlet Damper",1044,1044,1044,1044,1044,632,632,499,551,585,585,585,633,633,886,474,655,655,474,8.3000000000000004E-2,8.3000000000000004E-2,8.3000000000000004E-2,8.3000000000000004E-2,8.3000000000000004E-2,8.3000000000000004E-2,8.3000000000000004E-2,8.3000000000000004E-2,8.3000000000000004E-2,8.3000000000000004E-2,8.3000000000000004E-2,8.3000000000000004E-2,8.3000000000000004E-2,8.3000000000000004E-2,8.3000000000000004E-2,8.3000000000000004E-2,8.3000000000000004E-2,8.3000000000000004E-2,8.3000000000000004E-2,0.14299999999999999,0.14299999999999999,0.14299999999999999,0.14299999999999999,0.14299999999999999,0.14299999999999999,0.14299999999999999,0.14299999999999999,0.14299999999999999,0.14299999999999999,0.14299999999999999,0.14299999999999999,0.14299999999999999,0.14299999999999999,0.14299999999999999,0.14299999999999999,0.14299999999999999,0.14299999999999999,0.14299999999999999]
[null,"Chilled Water Pump",null,"TX1","AHU Supply Fan","Inlet Damper",1824,1824,1824,1824,1824,1125,1125,893,983,1045,1045,1045,1126,1126,1555,849,1163,1163,849,4.3999999999999997E-2,4.3999999999999997E-2,4.3999999999999997E-2,4.3999999999999997E-2,4.3999999999999997E-2,4.3999999999999997E-2,4.3999999999999997E-2,4.3999999999999997E-2,4.3999999999999997E-2,4.3999999999999997E-2,4.3999999999999997E-2,4.3999999999999997E-2,4.3999999999999997E-2,4.3999999999999997E-2,4.3999999999999997E-2,4.3999999999999997E-2,4.3999999999999997E-2,4.3999999999999997E-2,4.3999999999999997E-2]
[null,"Hot Water Pump",null,"TX2","AHU Supply Fan","Inlet Damper",1672,1672,1672,1672,1672,1024,1024,813,895,950,950,950,1025,1025,1420,773,1057,1057,773,2.5999999999999999E-2,2.5999999999999999E-2,2.5999999999999999E-2,2.5999999999999999E-2,2.5999999999999999E-2,2.5999999999999999E-2,2.5999999999999999E-2,2.5999999999999999E-2,2.5999999999999999E-2,2.5999999999999999E-2,2.5999999999999999E-2,2.5999999999999999E-2,2.5999999999999999E-2,2.5999999999999999E-2,2.5999999999999999E-2,2.5999999999999999E-2,2.5999999999999999E-2,2.5999999999999999E-2,2.5999999999999999E-2]
[null,null,null,"TX3","AHU Supply Fan","Inlet Damper",1596,1596,1596,1596,1596,967,967,765,847,896,896,896,966,966,1351,726,1001,1001,726,2.4E-2,2.4E-2,2.4E-2,2.4E-2,2.4E-2,2.4E-2,2.4E-2,2.4E-2,2.4E-2,2.4E-2,2.4E-2,2.4E-2,2.4E-2,2.4E-2,2.4E-2,2.4E-2,2.4E-2,2.4E-2,2.4E-2]
[null,"Outlet Damper",null,"TX4","AHU Supply Fan","Inlet Damper",1533,1533,1533,1533,1533,922,922,726,807,857,857,857,924,924,1296,689,960,960,689,6.9000000000000006E-2,6.9000000000000006E-2,6.9000000000000006E-2,6.9000000000000006E-2,6.9000000000000006E-2,6.9000000000000006E-2,6.9000000000000006E-2,6.9000000000000006E-2,6.9000000000000006E-2,6.9000000000000006E-2,6.9000000000000006E-2,6.9000000000000006E-2,6.9000000000000006E-2,6.9000000000000006E-2,6.9000000000000006E-2,6.9000000000000006E-2,6.9000000000000006E-2,6.9000000000000006E-2,6.9000000000000006E-2]
[null,"Inlet Damper",null,"TX5","AHU Supply Fan","Inlet Damper",1722,1722,1722,1722,1722,1051,1051,833,916,975,975,975,1051,1051,1461,793,1085,1085,793,4.7E-2,4.7E-2,4.7E-2,4.7E-2,4.7E-2,4.7E-2,4.7E-2,4.7E-2,4.7E-2,4.7E-2,4.7E-2,4.7E-2,4.7E-2,4.7E-2,4.7E-2,4.7E-2,4.7E-2,4.7E-2,4.7E-2]
[null,"Inlet Guide Vane",null,"TXCPS","AHU Supply Fan","Inlet Damper",1546,1546,1546,1546,1546,917,917,722,799,843,843,843,914,914,1300,686,947,947,686,9.7000000000000003E-2,9.7000000000000003E-2,9.7000000000000003E-2,9.7000000000000003E-2,9.7000000000000003E-2,9.7000000000000003E-2,9.7000000000000003E-2,9.7000000000000003E-2,9.7000000000000003E-2,9.7000000000000003E-2,9.7000000000000003E-2,9.7000000000000003E-2,9.7000000000000003E-2,9.7000000000000003E-2,9.7000000000000003E-2,9.7000000000000003E-2,9.7000000000000003E-2,9.7000000000000003E-2,9.7000000000000003E-2,0.23499999999999999,0.23499999999999999,0.23499999999999999,0.23499999999999999,0.23499999999999999,0.23499999999999999,0.23499999999999999,0.23499999999999999,0.23499999999999999,0.23499999999999999,0.23499999999999999,0.23499999999999999,0.23499999999999999,0.23499999999999999,0.23499999999999999,0.23499999999999999,0.23499999999999999,0.23499999999999999,0.23499999999999999]
[null,"No Control",null,"TX1","AHU Supply Fan","Inlet Guide Vane",388,388,388,388,388,237,237,188,207,219,219,219,237,237,329,179,244,244,179,0.01,0.01,0.01,0.01,0.01,0.01,0.01,0.01,0.01,0.01,0.01,0.01,0.01,0.01,0.01,0.01,0.01,0.01,0.01]
[null,null,null,"TX2","AHU Supply Fan","Inlet Guide Vane",345,345,345,345,345,209,209,166,183,194,194,194,209,209,292,158,216,216,158,8.9999999999999993E-3,8.9999999999999993E-3,8.9999999999999993E-3,8.9999999999999993E-3,8.9999999999999993E-3,8.9999999999999993E-3,8.9999999999999993E-3,8.9999999999999993E-3,8.9999999999999993E-3,8.9999999999999993E-3,8.9999999999999993E-3,8.9999999999999993E-3,8.9999999999999993E-3,8.9999999999999993E-3,8.9999999999999993E-3,8.9999999999999993E-3,8.9999999999999993E-3,8.9999999999999993E-3,8.9999999999999993E-3]
[null,"Hospital",null,"TX3","AHU Supply Fan","Inlet Guide Vane",324,324,324,324,324,194,194,153,170,179,179,179,193,193,273,145,201,201,145,5.0000000000000001E-3,5.0000000000000001E-3,5.0000000000000001E-3,5.0000000000000001E-3,5.0000000000000001E-3,5.0000000000000001E-3,5.0000000000000001E-3,5.0000000000000001E-3,5.0000000000000001E-3,5.0000000000000001E-3,5.0000000000000001E-3,5.0000000000000001E-3,5.0000000000000001E-3,5.0000000000000001E-3,5.0000000000000001E-3,5.0000000000000001E-3,5.0000000000000001E-3,5.0000000000000001E-3,5.0000000000000001E-3]
[null,"Healthcare",null,"TX4","AHU Supply Fan","Inlet Guide Vane",307,307,307,307,307,182,182,143,159,168,168,168,182,182,258,135,189,189,135,1.2E-2,1.2E-2,1.2E-2,1.2E-2,1.2E-2,1.2E-2,1.2E-2,1.2E-2,1.2E-2,1.2E-2,1.2E-2,1.2E-2,1.2E-2,1.2E-2,1.2E-2,1.2E-2,1.2E-2,1.2E-2,1.2E-2]
[null,"Nursing Home",null,"TX5","AHU Supply Fan","Inlet Guide Vane",359,359,359,359,359,216,216,171,189,200,200,200,216,216,303,163,223,223,163,1.2999999999999999E-2,1.2999999999999999E-2,1.2999999999999999E-2,1.2999999999999999E-2,1.2999999999999999E-2,1.2999999999999999E-2,1.2999999999999999E-2,1.2999999999999999E-2,1.2999999999999999E-2,1.2999999999999999E-2,1.2999999999999999E-2,1.2999999999999999E-2,1.2999999999999999E-2,1.2999999999999999E-2,1.2999999999999999E-2,1.2999999999999999E-2,1.2999999999999999E-2,1.2999999999999999E-2,1.2999999999999999E-2]
[null,"Hotel (Common Area)",null,"TXCPS","AHU Supply Fan","Inlet Guide Vane",312,312,312,312,312,182,182,143,159,167,167,167,181,181,261,136,188,188,136,1.6E-2,1.6E-2,1.6E-2,1.6E-2,1.6E-2,1.6E-2,1.6E-2,1.6E-2,1.6E-2,1.6E-2,1.6E-2,1.6E-2,1.6E-2,1.6E-2,1.6E-2,1.6E-2,1.6E-2,1.6E-2,1.6E-2,5.1999999999999998E-2,5.1999999999999998E-2,5.1999999999999998E-2,5.1999999999999998E-2,5.1999999999999998E-2,5.1999999999999998E-2,5.1999999999999998E-2,5.1999999999999998E-2,5.1999999999999998E-2,5.1999999999999998E-2,5.1999999999999998E-2,5.1999999999999998E-2,5.1999999999999998E-2,5.1999999999999998E-2,5.1999999999999998E-2,5.1999999999999998E-2,5.1999999999999998E-2,5.1999999999999998E-2,5.1999999999999998E-2]
[null,"Large Multifamily (Common Area)",null,"TX1","AHU Supply Fan","No Control",3299,3299,3299,3299,3299,2035,2035,1615,1778,1890,1890,1890,2038,2038,2814,1536,2104,2104,1536,2.8999999999999998E-3,2.8999999999999998E-3,2.8999999999999998E-3,2.8999999999999998E-3,2.8999999999999998E-3,2.8999999999999998E-3,2.8999999999999998E-3,2.8999999999999998E-3,2.8999999999999998E-3,2.8999999999999998E-3,2.8999999999999998E-3,2.8999999999999998E-3,2.8999999999999998E-3,2.8999999999999998E-3,2.8999999999999998E-3,2.8999999999999998E-3,2.8999999999999998E-3,2.8999999999999998E-3,2.8999999999999998E-3]
[null,"Office - Large",null,"TX2","AHU Supply Fan","No Control",3034,3034,3034,3034,3034,1856,1856,1473,1622,1721,1721,1721,1856,1856,2577,1401,1916,1916,1401,4.0000000000000001E-3,4.0000000000000001E-3,4.0000000000000001E-3,4.0000000000000001E-3,4.0000000000000001E-3,4.0000000000000001E-3,4.0000000000000001E-3,4.0000000000000001E-3,4.0000000000000001E-3,4.0000000000000001E-3,4.0000000000000001E-3,4.0000000000000001E-3,4.0000000000000001E-3,4.0000000000000001E-3,4.0000000000000001E-3,4.0000000000000001E-3,4.0000000000000001E-3,4.0000000000000001E-3,4.0000000000000001E-3]
[null,"Office - Medium",null,"TX3","AHU Supply Fan","No Control",2902,2902,2902,2902,2902,1755,1755,1387,1538,1624,1624,1624,1752,1752,2455,1316,1817,1817,1316,2.5999999999999999E-2,2.5999999999999999E-2,2.5999999999999999E-2,2.5999999999999999E-2,2.5999999999999999E-2,2.5999999999999999E-2,2.5999999999999999E-2,2.5999999999999999E-2,2.5999999999999999E-2,2.5999999999999999E-2,2.5999999999999999E-2,2.5999999999999999E-2,2.5999999999999999E-2,2.5999999999999999E-2,2.5999999999999999E-2,2.5999999999999999E-2,2.5999999999999999E-2,2.5999999999999999E-2,2.5999999999999999E-2]
[null,"Office - Small",null,"TX4","AHU Supply Fan","No Control",2791,2791,2791,2791,2791,1675,1675,1318,1465,1554,1554,1554,1676,1676,2357,1248,1742,1742,1248,8.5999999999999993E-2,8.5999999999999993E-2,8.5999999999999993E-2,8.5999999999999993E-2,8.5999999999999993E-2,8.5999999999999993E-2,8.5999999999999993E-2,8.5999999999999993E-2,8.5999999999999993E-2,8.5999999999999993E-2,8.5999999999999993E-2,8.5999999999999993E-2,8.5999999999999993E-2,8.5999999999999993E-2,8.5999999999999993E-2,8.5999999999999993E-2,8.5999999999999993E-2,8.5999999999999993E-2,8.5999999999999993E-2]
[null,"Education",null,"TX5","AHU Supply Fan","No Control",3123,3123,3123,3123,3123,1906,1906,1510,1661,1766,1766,1766,1906,1906,2650,1437,1967,1967,1437,2.4E-2,2.4E-2,2.4E-2,2.4E-2,2.4E-2,2.4E-2,2.4E-2,2.4E-2,2.4E-2,2.4E-2,2.4E-2,2.4E-2,2.4E-2,2.4E-2,2.4E-2,2.4E-2,2.4E-2,2.4E-2,2.4E-2]
[null,"Convenience Store",null,"TXCPS","AHU Supply Fan","No Control",2803,2803,2803,2803,2803,1657,1657,1302,1443,1519,1519,1519,1649,1649,2356,1237,1710,1710,1237,0.151,0.151,0.151,0.151,0.151,0.151,0.151,0.151,0.151,0.151,0.151,0.151,0.151,0.151,0.151,0.151,0.151,0.151,0.151,0.42299999999999999,0.42299999999999999,0.42299999999999999,0.42299999999999999,0.42299999999999999,0.42299999999999999,0.42299999999999999,0.42299999999999999,0.42299999999999999,0.42299999999999999,0.42299999999999999,0.42299999999999999,0.42299999999999999,0.42299999999999999,0.42299999999999999,0.42299999999999999,0.42299999999999999,0.42299999999999999,0.42299999999999999]
[null,"Service",null,"TX1","Chilled Water Pump",null,777,777,777,777,777,562,562,455,490,552,552,552,585,585,721,433,599,599,433,4.5999999999999999E-2,4.5999999999999999E-2,4.5999999999999999E-2,4.5999999999999999E-2,4.5999999999999999E-2,4.5999999999999999E-2,4.5999999999999999E-2,4.5999999999999999E-2,4.5999999999999999E-2,4.5999999999999999E-2,4.5999999999999999E-2,4.5999999999999999E-2,4.5999999999999999E-2,4.5999999999999999E-2,4.5999999999999999E-2,4.5999999999999999E-2,4.5999999999999999E-2,4.5999999999999999E-2,4.5999999999999999E-2]
[null,"Strip Mall",null,"TX2","Chilled Water Pump",null,1154,1154,1154,1154,1154,775,775,624,683,747,747,747,795,795,1030,594,818,818,594,1.7999999999999999E-2,1.7999999999999999E-2,1.7999999999999999E-2,1.7999999999999999E-2,1.7999999999999999E-2,1.7999999999999999E-2,1.7999999999999999E-2,1.7999999999999999E-2,1.7999999999999999E-2,1.7999999999999999E-2,1.7999999999999999E-2,1.7999999999999999E-2,1.7999999999999999E-2,1.7999999999999999E-2,1.7999999999999999E-2,1.7999999999999999E-2,1.7999999999999999E-2,1.7999999999999999E-2,1.7999999999999999E-2]
[null,"Stand-Alone Retail",null,"TX3","Chilled Water Pump",null,1337,1337,1337,1337,1337,880,880,702,767,847,847,847,904,904,1181,669,931,931,669,2.9000000000000001E-2,2.9000000000000001E-2,2.9000000000000001E-2,2.9000000000000001E-2,2.9000000000000001E-2,2.9000000000000001E-2,2.9000000000000001E-2,2.9000000000000001E-2,2.9000000000000001E-2,2.9000000000000001E-2,2.9000000000000001E-2,2.9000000000000001E-2,2.9000000000000001E-2,2.9000000000000001E-2,2.9000000000000001E-2,2.9000000000000001E-2,2.9000000000000001E-2,2.9000000000000001E-2,2.9000000000000001E-2]
[null,"Supermarket",null,"TX4","Chilled Water Pump",null,1479,1479,1479,1479,1479,966,966,766,841,917,917,917,980,980,1295,728,1009,1009,728,9.0999999999999998E-2,9.0999999999999998E-2,9.0999999999999998E-2,9.0999999999999998E-2,9.0999999999999998E-2,9.0999999999999998E-2,9.0999999999999998E-2,9.0999999999999998E-2,9.0999999999999998E-2,9.0999999999999998E-2,9.0999999999999998E-2,9.0999999999999998E-2,9.0999999999999998E-2,9.0999999999999998E-2,9.0999999999999998E-2,9.0999999999999998E-2,9.0999999999999998E-2,9.0999999999999998E-2,9.0999999999999998E-2]
[null,"Restaurants",null,"TX5","Chilled Water Pump",null,1049,1049,1049,1049,1049,734,734,591,646,705,705,705,753,753,959,563,772,772,563,4.2999999999999997E-2,4.2999999999999997E-2,4.2999999999999997E-2,4.2999999999999997E-2,4.2999999999999997E-2,4.2999999999999997E-2,4.2999999999999997E-2,4.2999999999999997E-2,4.2999999999999997E-2,4.2999999999999997E-2,4.2999999999999997E-2,4.2999999999999997E-2,4.2999999999999997E-2,4.2999999999999997E-2,4.2999999999999997E-2,4.2999999999999997E-2,4.2999999999999997E-2,4.2999999999999997E-2,4.2999999999999997E-2]
[null,"Warehouse",null,"TXCPS","Chilled Water Pump",null,1360,1360,1360,1360,1360,894,894,704,777,847,847,847,908,908,1195,668,933,933,668,0.13800000000000001,0.13800000000000001,0.13800000000000001,0.13800000000000001,0.13800000000000001,0.13800000000000001,0.13800000000000001,0.13800000000000001,0.13800000000000001,0.13800000000000001,0.13800000000000001,0.13800000000000001,0.13800000000000001,0.13800000000000001,0.13800000000000001,0.13800000000000001,0.13800000000000001,0.13800000000000001,0.13800000000000001,0.29499999999999998,0.29499999999999998,0.29499999999999998,0.29499999999999998,0.29499999999999998,0.29499999999999998,0.29499999999999998,0.29499999999999998,0.29499999999999998,0.29499999999999998,0.29499999999999998,0.29499999999999998,0.29499999999999998,0.29499999999999998,0.29499999999999998,0.29499999999999998,0.29499999999999998,0.29499999999999998,0.29499999999999998]
[null,"Assembly",null,"TX1","Hot Water Pump",null,1304,1304,1304,1304,1304,777,777,612,679,708,708,708,767,767,1091,581,794,794,581,0.123,0.123,0.123,0.123,0.123,0.123,0.123,0.123,0.123,0.123,0.123,0.123,0.123,0.123,0.123,0.123,0.123,0.123,0.123]
[null,"Worship",null,"TX2","Hot Water Pump",null,912,912,912,912,912,536,536,423,468,482,482,482,527,527,757,403,544,544,403,4.4999999999999998E-2,4.4999999999999998E-2,4.4999999999999998E-2,4.4999999999999998E-2,4.4999999999999998E-2,4.4999999999999998E-2,4.4999999999999998E-2,4.4999999999999998E-2,4.4999999999999998E-2,4.4999999999999998E-2,4.4999999999999998E-2,4.4999999999999998E-2,4.4999999999999998E-2,4.4999999999999998E-2,4.4999999999999998E-2,4.4999999999999998E-2,4.4999999999999998E-2,4.4999999999999998E-2,4.4999999999999998E-2]
[null,"Other",null,"TX3","Hot Water Pump",null,723,723,723,723,723,419,419,329,369,376,376,376,411,411,600,310,427,427,310,4.7E-2,4.7E-2,4.7E-2,4.7E-2,4.7E-2,4.7E-2,4.7E-2,4.7E-2,4.7E-2,4.7E-2,4.7E-2,4.7E-2,4.7E-2,4.7E-2,4.7E-2,4.7E-2,4.7E-2,4.7E-2,4.7E-2]
[null,null,null,"TX4","Hot Water Pump",null,597,597,597,597,597,332,332,261,295,301,301,301,330,330,491,246,345,345,246,0.108,0.108,0.108,0.108,0.108,0.108,0.108,0.108,0.108,0.108,0.108,0.108,0.108,0.108,0.108,0.108,0.108,0.108,0.108]
[null,null,null,"TX5","Hot Water Pump",null,1044,1044,1044,1044,1044,609,609,475,528,560,560,560,608,608,867,451,632,632,451,0.22900000000000001,0.22900000000000001,0.22900000000000001,0.22900000000000001,0.22900000000000001,0.22900000000000001,0.22900000000000001,0.22900000000000001,0.22900000000000001,0.22900000000000001,0.22900000000000001,0.22900000000000001,0.22900000000000001,0.22900000000000001,0.22900000000000001,0.22900000000000001,0.22900000000000001,0.22900000000000001,0.22900000000000001]
[null,null,null,"TXCPS","Hot Water Pump",null,624,624,624,624,624,342,342,270,302,301,301,301,331,331,511,255,346,346,255,0,0,0,0,0,0,0,0,0,0,0,0,0,0,0,0,{"$f":"MIN(Z335:AO335)","v":0},{"$f":"MIN(AA335:AP335)","v":0},0,0.29499999999999998,0.29499999999999998,0.29499999999999998,0.29499999999999998,0.29499999999999998,0.29499999999999998,0.29499999999999998,0.29499999999999998,0.29499999999999998,0.29499999999999998,0.29499999999999998,0.29499999999999998,0.29499999999999998,0.29499999999999998,0.29499999999999998,0.29499999999999998,0.29499999999999998,0.29499999999999998,0.29499999999999998]
[]
[]
[]
[null,"Condenser Air Evaporative Pre-Cooling",null,null,"DRF",null,null,null,null,null,null,null,null,null,null,null,"EFLHreduction",null,null,null,null,null,null,null,null,null,null,null,null,"Weather Zone","Temperature (°F)","Humidity (%)"]
[null,null,null,"Building Type","TX1DX","TX2DX","TX3DX","TX4DX","TX5DX","TXCPSDX","TX1ACC","TX2ACC","TX3ACC","TX4ACC","TX5ACC","TXCPSACC","TX1DX","TX2DX","TX3DX","TX4DX","TX5DX","TXCPSDX","TX1ACC","TX2ACC","TX3ACC","TX4ACC","TX5ACC","TXCPSACC",null,"TX1",95.8,25]
[null,null,null,"College",0.19,0.21,0.2,0.13,0.27,0.2,0.17,0.19,0.17,0.11,0.22,0.17,130,192,173,161,240,173,150,195,175,160,254,175,null,"TX2",101.2,34]
[null,null,null,"Primary School",0.2,0.24,0.21,0.14000000000000001,0.3,0.21,0.13,0.12,0.1,7.0000000000000007E-2,0.17,0.1,83,120,118,113,161,118,69,80,74,68,120,74,null,"TX3",99.1,37]
[null,null,null,"Secondary School",0.19,0.21,0.2,0.13,0.27,0.2,0.17,0.19,0.17,0.11,0.22,0.17,89,131,118,110,163,118,102,132,119,109,172,119,null,"TX4",92.5,49]
[null,null,null,"Convenience",0.18,0.24,0.22,0.14000000000000001,0.25,0.22,"-","-","-","-","-","-",125,214,193,188,232,193,"-","-","-","-","-","-",null,"TX5",97.4,15]
[null,null,null,"Supermarket",0.08,0.15,0.14000000000000001,0.08,0.12,0.14000000000000001,"-","-","-","-","-","-",37,78,76,74,76,76,"-","-","-","-","-","-",null,"TXCPS",99.1,37]
[null,null,null,"Full-Service Restaurant",0.21,0.23,0.21,0.13,0.25,0.21,"-","-","-","-","-","-",134,194,171,157,223,171,"-","-","-","-","-","-"]
[null,null,null,"Quick-Service Restaurant",0.18,0.24,0.22,0.14000000000000001,0.25,0.22,"-","-","-","-","-","-",109,185,167,162,201,167,"-","-","-","-","-","-"]
[null,null,null,"Hospital",0.21,0.24,0.21,0.15,0.26,0.21,0.18,0.22,0.19,0.09,0.2,0.19,160,230,202,199,273,202,151,216,187,169,247,187]
[null,null,null,"Outpatient Healthcare",0.17,0.19,0.18,0.12,0.23,0.18,"-","-","-","-","-","-",145,174,157,150,259,157,"-","-","-","-","-","-"]
[null,null,null,"Midrise Apartment",0.18,0.16,0.17,0.14000000000000001,0.28000000000000003,0.17,0.1,0.15,0.14000000000000001,0.09,0.15,0.14000000000000001,113,230,257,181,264,257,59,120,105,104,140,105]
[null,null,null,"Large Hotel",0.13,0.15,0.14000000000000001,0.08,0.19,0.14000000000000001,0.15,0.18,0.14000000000000001,0.1,0.19,0.14000000000000001,111,137,120,116,201,120,165,212,193,179,300,193]
[null,null,null,"Nursing Home",0.18,0.16,0.17,0.14000000000000001,0.28000000000000003,0.17,0.1,0.15,0.14000000000000001,0.09,0.15,0.14000000000000001,115,234,261,183,268,261,60,122,107,106,142,107]
[null,null,null,"Small Hotel/Motel",0.13,0.15,0.13,0.08,0.17,0.13,"-","-","-","-","-","-",104,133,113,109,193,113,"-","-","-","-","-","-"]
[null,null,null,"Stand-Alone Retail",0.19,0.24,0.22,0.14000000000000001,0.25,0.22,0.14000000000000001,0.19,0.19,0.12,0.18,0.19,108,158,152,148,198,152,74,120,128,120,131,128]
[null,null,null,"Strip Mall",0.21,0.23,0.21,0.13,0.26,0.21,"-","-","-","-","-","-",121,156,152,146,207,152,"-","-","-","-","-","-"]
[null,null,null,"Large Office",0.25,0.26,0.24,0.16,0.32,0.24,0.18,0.23,0.23,0.13,0.22,0.23,206,220,203,192,314,203,119,231,150,137,199,150]
[null,null,null,"Medium Office",0.19,0.2,0.19,0.11,0.25,0.19,"-","-","-","-","-","-",75,102,94,90,137,94,"-","-","-","-","-","-"]
[null,null,null,"Small Office",0.2,0.22,0.2,0.13,0.26,0.2,"-","-","-","-","-","-",111,156,138,131,215,138,"-","-","-","-","-","-"]
[null,null,null,"Public Assembly ",0.2,0.24,0.21,0.14000000000000001,0.3,0.21,0.13,0.12,0.1,7.0000000000000007E-2,0.17,0.1,112,161,159,152,217,159,93,108,99,92,162,99]
[null,null,null,"Religious Worship",0.19,0.24,0.22,0.14000000000000001,0.25,0.22,0.14000000000000001,0.19,0.19,0.12,0.18,0.19,65,95,92,89,119,92,45,72,77,72,79,77]
[null,null,null,"Service",0.21,0.23,0.21,0.13,0.25,0.21,"-","-","-","-","-","-",104,150,132,122,173,132,"-","-","-","-","-","-"]
[null,null,null,"Warehouse",0.12,0.2,0.18,0.12,0.25,0.18,"-","-","-","-","-","-",34,93,81,74,82,81,"-","-","-","-","-","-"]
[null,null,null,"Other",0.08,0.15,0.13,0.08,0.12,0.13,0.1,0.12,0.1,7.0000000000000007E-2,0.15,0.1,34,78,76,74,76,76,45,72,74,68,79,74]
[]
[null,"Guestroom, Dormitory and Multifamily Occupancy Control (NC & Retro)"]
[null,null,null,null,null,null,null,"5 Degree","5 Degree","5 Degree","5 Degree","10 Degree","10 Degree","10 Degree","10 Degree","5 Degree","5 Degree","5 Degree","5 Degree","10 Degree","10 Degree","10 Degree","10 Degree","5 Degree","5 Degree","5 Degree","5 Degree","10 Degree","10 Degree","10 Degree","10 Degree"]
[null,null,null,null,null,null,null,"Heat Pump","Heat Pump","Electric Resistance","Electric Resistance","Heat Pump","Heat Pump","Electric Resistance","Electric Resistance","Heat Pump","Heat Pump","Electric Resistance","Electric Resistance","Heat Pump","Heat Pump","Electric Resistance","Electric Resistance","Heat Pump","Heat Pump","Electric Resistance","Electric Resistance","Heat Pump","Heat Pump","Electric Resistance","Electric Resistance"]
[null,null,null,null,null,null,null,"HVAC Only","HVAC & Lights","HVAC Only","HVAC & Lights","HVAC Only","HVAC & Lights","HVAC Only","HVAC & Lights","HVAC Only","HVAC & Lights","HVAC Only","HVAC & Lights","HVAC Only","HVAC & Lights","HVAC Only","HVAC & Lights","HVAC Only","HVAC & Lights","HVAC Only","HVAC & Lights","HVAC Only","HVAC & Lights","HVAC Only","HVAC & Lights"]
[null,null,null,"State","Region","Building Type","Lookup","Peak kW","Peak kW","Peak kW","Peak kW","Peak kW","Peak kW","Peak kW","Peak kW","kWh","kWh","kWh","kWh","kWh","kWh","kWh","kWh","NCP kW","NCP kW","NCP kW","NCP kW","NCP kW","NCP kW","NCP kW","NCP kW"]
[null,null,null,null,null,null,null,{"$f":"H366&H367&H368&H369","v":"5 DegreeHeat PumpHVAC OnlyPeak kW"},"5 DegreeHeat PumpHVAC & LightsPeak kW","5 DegreeElectric ResistanceHVAC OnlyPeak kW","5 DegreeElectric ResistanceHVAC & LightsPeak kW","10 DegreeHeat PumpHVAC OnlyPeak kW","10 DegreeHeat PumpHVAC & LightsPeak kW","10 DegreeElectric ResistanceHVAC OnlyPeak kW","10 DegreeElectric ResistanceHVAC & LightsPeak kW","5 DegreeHeat PumpHVAC OnlykWh","5 DegreeHeat PumpHVAC & LightskWh","5 DegreeElectric ResistanceHVAC OnlykWh","5 DegreeElectric ResistanceHVAC & LightskWh","10 DegreeHeat PumpHVAC OnlykWh","10 DegreeHeat PumpHVAC & LightskWh","10 DegreeElectric ResistanceHVAC OnlykWh","10 DegreeElectric ResistanceHVAC & LightskWh","5 DegreeHeat PumpHVAC OnlyNCP kW","5 DegreeHeat PumpHVAC & LightsNCP kW","5 DegreeElectric ResistanceHVAC OnlyNCP kW","5 DegreeElectric ResistanceHVAC & LightsNCP kW","10 DegreeHeat PumpHVAC OnlyNCP kW","10 DegreeHeat PumpHVAC & LightsNCP kW","10 DegreeElectric ResistanceHVAC OnlyNCP kW","10 DegreeElectric ResistanceHVAC & LightsNCP kW"]
[null,null,null,"TX",1,"Motel",{"$f":"D371&E371&F371","v":"TX1Motel"},5.8999999999999997E-2,7.4999999999999997E-2,5.8999999999999997E-2,7.4999999999999997E-2,0.111,0.126,0.111,0.126,267,380,341,441,486,598,627,726,0,0,0,0,0,0,0,0]
[null,null,null,"TX",1,"Hotel",{"$f":"D372&E372&F372","v":"TX1Hotel"},5.2999999999999999E-2,7.1999999999999995E-2,5.2999999999999999E-2,7.1999999999999995E-2,0.10199999999999999,0.121,0.10199999999999999,0.121,232,439,303,530,426,568,557,684,0,0,0,0,0,0,0,0]
[null,null,null,"TX",1,"Dormitory","TX1Dormitory",3.4000000000000002E-2,6.0999999999999999E-2,3.4000000000000002E-2,6.0999999999999999E-2,7.2999999999999995E-2,8.4000000000000005E-2,7.2999999999999995E-2,8.4000000000000005E-2,136,319,152,316,261,404,289,417,0,0,0,0,0,0,0,0]
[null,null,null,"TX",2,"Motel","TX2Motel",7.5999999999999998E-2,9.0999999999999998E-2,7.5999999999999998E-2,9.0999999999999998E-2,0.14599999999999999,0.161,0.14599999999999999,0.161,315,443,365,485,559,686,640,761,0,0,0,0,0,0,0,0]
[null,null,null,"TX",2,"Hotel","TX2Hotel",7.2999999999999995E-2,9.2999999999999999E-2,7.2999999999999995E-2,9.2999999999999999E-2,0.13400000000000001,0.154,0.13400000000000001,0.154,258,452,303,505,452,617,517,676,0,0,0,0,0,0,0,0]
[null,null,null,"TX",2,"Dormitory","TX2Dormitory",4.8000000000000001E-2,7.5999999999999998E-2,4.8000000000000001E-2,7.5999999999999998E-2,7.8E-2,0.105,7.8E-2,0.105,214,425,223,428,293,505,304,511,0,0,0,0,0,0,0,0]
[null,null,null,"TX",3,"Motel","TX3Motel",8.2000000000000003E-2,9.7000000000000003E-2,8.2000000000000003E-2,9.7000000000000003E-2,0.151,0.16600000000000001,0.151,0.16600000000000001,324,461,351,484,559,695,602,735,0,0,0,0,0,0,0,0]
[null,null,null,"TX",3,"Hotel","TX3Hotel",7.3999999999999996E-2,9.4E-2,7.3999999999999996E-2,9.4E-2,0.13600000000000001,0.156,0.13600000000000001,0.156,242,430,260,450,423,599,446,621,0,0,0,0,0,0,0,0]
[null,null,null,"TX",3,"Dormitory","TX3Dormitory",5.0999999999999997E-2,7.8E-2,5.0999999999999997E-2,7.8E-2,8.1000000000000003E-2,0.108,8.1000000000000003E-2,0.108,242,461,244,462,326,543,328,545,0,0,0,0,0,0,0,0]
[null,null,null,"TX",4,"Motel","TX4Motel",8.5999999999999993E-2,0.10299999999999999,8.5999999999999993E-2,0.10299999999999999,0.16300000000000001,0.17899999999999999,0.16300000000000001,0.17899999999999999,354,500,369,513,617,761,650,792,0,0,0,0,0,0,0,0]
[null,null,null,"TX",4,"Hotel","TX4Hotel",8.1000000000000003E-2,0.10199999999999999,8.1000000000000003E-2,0.10199999999999999,0.14899999999999999,0.16900000000000001,0.14899999999999999,0.16900000000000001,260,451,267,459,467,652,483,667,0,0,0,0,0,0,0,0]
[null,null,null,"TX",4,"Dormitory","TX4Dormitory",5.2999999999999999E-2,8.1000000000000003E-2,5.2999999999999999E-2,8.1000000000000003E-2,8.7999999999999995E-2,0.114,8.7999999999999995E-2,0.114,265,492,266,492,368,591,370,593,0,0,0,0,0,0,0,0]
[null,null,null,"TX",5,"Motel","TX5Motel",6.3E-2,7.8E-2,6.3E-2,7.8E-2,0.11799999999999999,0.13300000000000001,0.11799999999999999,0.13300000000000001,251,379,283,406,432,561,482,607,0,0,0,0,0,0,0,0]
[null,null,null,"TX",5,"Hotel","TX5Hotel",5.6000000000000001E-2,7.4999999999999997E-2,5.6000000000000001E-2,7.4999999999999997E-2,0.106,0.126,0.106,0.126,178,360,196,380,312,479,338,501,0,0,0,0,0,0,0,0]
[null,null,null,"TX",5,"Dormitory","TX5Dormitory",3.1E-2,5.8999999999999997E-2,3.1E-2,5.8999999999999997E-2,4.4999999999999998E-2,0.06,4.4999999999999998E-2,0.06,110,327,110,326,151,448,153,450,0,0,0,0,0,0,0,0]
[null,null,null,"TX","CPS","Motel","TXCPSMotel",8.2000000000000003E-2,9.7000000000000003E-2,8.2000000000000003E-2,9.7000000000000003E-2,0.151,0.16600000000000001,0.151,0.16600000000000001,324,461,351,484,559,695,602,735,5.8000000000000003E-2,6.9000000000000006E-2,5.8000000000000003E-2,6.9000000000000006E-2,0.107,0.11799999999999999,0.107,0.11799999999999999]
[null,null,null,"TX","CPS","Hotel","TXCPSHotel",7.3999999999999996E-2,9.4E-2,7.3999999999999996E-2,9.4E-2,0.13600000000000001,0.156,0.13600000000000001,0.156,242,430,260,450,423,599,446,621,5.2999999999999999E-2,6.7000000000000004E-2,5.2999999999999999E-2,6.7000000000000004E-2,9.7000000000000003E-2,0.111,9.7000000000000003E-2,0.111]
[null,null,null,"TX","CPS","Dormitory","TXCPSDormitory",5.0999999999999997E-2,7.8E-2,5.0999999999999997E-2,7.8E-2,8.1000000000000003E-2,0.108,8.1000000000000003E-2,0.108,242,461,244,462,326,543,328,545,3.5999999999999997E-2,5.5E-2,3.5999999999999997E-2,5.5E-2,5.8000000000000003E-2,7.6999999999999999E-2,5.8000000000000003E-2,7.6999999999999999E-2]
[]
[null,null,null,"Motel","HVAC Only","Heat Pump","5 Degree"]
[null,null,null,"Hotel","HVAC & Lights","Electric Resistance","10 Degree"]
[null,null,null,"Dormitory"]
[]
[null,"Smart Thermostats"]
[]
[null,null,null,"Principal Building Activity","TX1EFLHc","TX1EFLHh","TX1DFs","TX1DFw","TX2EFLHc","TX2EFLHh","TX2DFs","TX2DFw","TX3EFLHc","TX3EFLHh","TX3DFs","TX3DFw","TX4EFLHc","TX4EFLHh","TX4DFs","TX4DFw","TX5EFLHc","TX5EFLHh","TX5DFs","TX5DFw"]
[null,null,null,"College",787,340,0.69,0.27,1595,153,1.02,0.28000000000000003,1843,69,0.98,0.19,2211,2211,0.96,0.08,1092,146,0.87,0.04]
[null,null,null,"Primary School",740,701,0.64,0.43,1208,397,0.88,0.66,1443,239,0.88,0.5,1680,1680,0.88,0.3,996,408,0.91,0.37]
[null,null,null,"Secondary School",535,736,0.69,0.43,1084,489,1.02,0.59,1253,293,0.98,0.54,1503,1503,0.96,0.35,742,431,0.87,0.43]
[null,null,null,"Convenience",884,340,0.73,0.27,1835,153,1.08,0.28000000000000003,2142,69,1.03,0.19,2510,2510,0.94,0.08,1251,146,0.76,0.04]
[null,null,null,"Supermarket",219,340,0.28999999999999998,0.27,615,153,0.57999999999999996,0.28000000000000003,744,69,0.6,0.19,894,894,0.54,0.08,347,146,0.38,0.04]
[null,null,null,"Full-Service Restaurant",1020,1123,0.83,0.43,1823,688,1.0900000000000001,0.5,2135,429,1.05,0.44,2530,2530,0.98,0.35,1276,613,0.76,0.28000000000000003]
[null,null,null,"24Hr Full-Service",1093,1346,0.81,0.43,2061,873,1.0900000000000001,0.49,2426,559,1.06,0.44,2897,2897,0.97,0.36,1413,809,0.74,0.27]
[null,null,null,"Quick-Service Restaurant",765,1029,0.73,0.48,1588,631,1.08,0.61,1853,372,1.03,0.51,2172,2172,0.94,0.34,1082,522,0.76,0.26]
[null,null,null,"24Hr Quick Service",817,1300,0.74,0.48,1765,794,1.08,0.6,2059,483,1.05,0.5,2440,2440,0.93,0.34,1171,697,0.77,0.26]
[null,null,null,"Hospital",2185,340,0.72,0.27,3097,153,0.92,0.28000000000000003,3490,69,0.9,0.19,3819,3819,0.86,0.08,2555,146,0.81,0.04]
[null,"BAF",null,"Outpatient Healthcare",2036,579,0.71,0.27,2532,310,0.8,0.28000000000000003,2844,196,0.8,0.28999999999999998,3092,3092,0.78,0.08,2377,320,0.81,0.04]
[null,"Manual Thermostat",1,"Midrise Apartment",674,340,0.68,0.27,1709,153,1.04,0.28000000000000003,2031,69,1,0.19,2236,2236,0.92,0.08,1209,146,0.88,0.04]
[null,"Programmable Thermostat",0.6,"Large Hotel",1345,1095,0.57999999999999996,0.86,2079,464,0.7,0.82,2531,250,0.7,0.33,2981,2981,0.65,0.21,1701,440,0.63,0.21]
[null,"Unknown",0.8,"Nursing Home",685,340,0.68,0.27,1736,153,1.04,0.28000000000000003,2063,69,1,0.19,2271,2271,0.92,0.08,1228,146,0.88,0.04]
[null,"New Construction",0.6,"Small Hotel/Motel",1554,475,0.56999999999999995,0.36,2281,249,0.55000000000000004,0.42,2316,147,0.65,0.19,2530,2530,0.57999999999999996,0.1,1921,185,0.63,0.06]
[null,null,null,"Stand-Alone Retail",623,907,0.68,0.99,1157,352,0.95,0.55000000000000004,1399,204,0.95,0.43,1582,1582,0.84,0.22,904,384,0.8,0.26]
[null,null,null,"24Hr Stand-Alone Retail",820,1277,0.8,0.43,1539,632,1.01,0.56999999999999995,1804,374,0.97,0.41,2118,2118,0.86,0.25,1228,808,0.86,0.28000000000000003]
[null,null,null,"Strip Mall",687,753,0.75,0.39,1100,376,0.91,0.55000000000000004,1330,218,0.92,0.42,1510,1510,0.82,0.21,931,448,0.83,0.27]
[null,null,null,"Large Office",2058,340,0.9,0.27,2379,153,1.03,0.28000000000000003,2619,69,1,0.19,2778,2778,0.91,0.08,2423,146,0.98,0.04]
[null,null,null,"Medium Office",925,576,0.64,0.72,1236,262,0.76,0.66,1387,149,0.75,0.42,1523,1523,0.66,0.24,1173,256,0.77,0.27]
[null,null,null,"Small Office",711,340,0.72,0.28999999999999998,1203,153,0.92,0.4,1338,69,0.88,0.28000000000000003,1504,1504,0.8,0.14000000000000001,1037,146,0.84,0.15]
[null,null,null,"Public Assembly ",995,340,0.64,0.27,1624,153,0.88,0.28000000000000003,1940,69,0.88,0.19,2259,2259,0.88,0.08,1339,146,0.91,0.04]
[null,null,null,"Religious Worship",387,340,0.56999999999999995,0.27,567,153,0.55000000000000004,0.28000000000000003,576,69,0.65,0.19,629,629,0.57999999999999996,0.08,478,146,0.63,0.04]
[null,null,null,"Service",790,340,0.83,0.27,1412,153,1.0900000000000001,0.28000000000000003,1653,69,1.05,0.19,1959,1959,0.98,0.08,988,146,0.76,0.04]
[null,null,null,"Warehouse",173,340,0.34,0.27,597,153,0.84,0.28000000000000003,633,69,0.84,0.19,665,665,0.73,0.08,324,146,0.75,0.04]
[null,null,null,"Other",173,340,0.28999999999999998,0.27,567,153,0.55000000000000004,0.28000000000000003,576,69,0.6,0.19,629,629,0.54,0.08,324,146,0.38,0.04]
[]
[null,"HVLS Fans"]
[null,null,null,"Climate Zone","Hours"]
[null,null,null,"TX1",2215]
[null,"Used TX3 for CPS",null,"TX2",3969]
[null,"Disregarded ER case for simplicity",null,"TX3",4750]
[null,null,null,"TX4",5375]
[null,null,null,"TX5",3034]
[null,null,null,"TXCPS",4750]
[]
[]
[null,"Efficient motors for CRAH",null,"Motor Horsepower",1,2,3,5,7.5,10,15]
[null,null,null,"Efficiency",0.85499999999999998,0.86499999999999999,0.89500000000000002,0.89500000000000002,0.91,0.91700000000000004,0.93]
[]
[]
[]
[null,"EnergyStar Pool Pumps"]
[null,null,null,null,"kWh savings",null,null,"Demand Savings (kW)"]
[null,null,null,"Rated Pump hp (new)","Year-Round 24/7 Operation","Year-Round Limited-Hours Operation","Seasonal Operation (7 months)","Year-Round 24/7 Operation","Year-Round Limited-Hours Operation","Seasonal Operation (7 months)"]
[null,null,null,"≤ 1.25",11259,5630,3282,1.2849999999999999,1.2849999999999999,0.749]
[null,null,null," 1.25 < hp ≤ 1.75",13518,6759,3941,1.5429999999999999,1.5429999999999999,0.9]
[null,null,null,"1.75 < hp ≤ 2.25",15263,7632,4449,1.742,1.742,1.016]
[null,null,null,"2.25 < hp ≤ 2.75",15773,7887,4598,1.8009999999999999,1.8009999999999999,1.05]
[null,null,null,"2.75 < hp ≤ 5",19250,9625,5612,2.198,2.198,1.2809999999999999]
[]
[null,"Premium Efficiency Motors"]
[null,null,null,"Application","Load Factor",null,null,null,null,null,"Hours"]
[null,null,null,"Motor Range (Min of Size) ->",1,6,21,51,101,201,1,6,21,51,101,201]
[null,null,null,"HVAC - Hospital",0.75,0.75,0.75,0.75,0.75,0.75,8760,8760,8760,8760,8760,8760]
[null,null,null,"HVAC - Large Office (>30K SqFt)",0.75,0.75,0.75,0.75,0.75,0.75,4424,4424,4424,4424,4424,4424]
[null,null,null,"HVAC - Small Office (<30k Sq Ft)",0.75,0.75,0.75,0.75,0.75,0.75,4006,4006,4006,4006,4006,4006]
[null,null,null,"HVAC - K-12 School",0.75,0.75,0.75,0.75,0.75,0.75,4173,4173,4173,4173,4173,4173]
[null,null,null,"HVAC - College",0.75,0.75,0.75,0.75,0.75,0.75,4590,4590,4590,4590,4590,4590]
[null,null,null,"HVAC - Retail",0.75,0.75,0.75,0.75,0.75,0.75,5548,5548,5548,5548,5548,5548]
[null,null,null,"HVAC - Restaurant (Fast Food)",0.75,0.75,0.75,0.75,0.75,0.75,6716,6716,6716,6716,6716,6716]
[null,null,null,"HVAC - Restaurant (Sit Down)",0.75,0.75,0.75,0.75,0.75,0.75,5256,5256,5256,5256,5256,5256]
[null,null,null,"Industrial - Chem",0.54,0.51,0.6,0.54,0.75,0.57999999999999996,4082,4910,4873,5853,5868,5474]
[null,null,null,"Industrial - Paper",0.54,0.51,0.6,0.54,0.75,0.57999999999999996,3997,4634,5481,6741,6669,6975]
[null,null,null,"Industrial - Metals",0.54,0.51,0.6,0.54,0.75,0.57999999999999996,4377,4140,4854,6698,7362,7114]
[null,null,null,"Industrial - Petroleum Refinery",0.54,0.51,0.6,0.54,0.75,0.57999999999999996,1582,1944,3025,3763,4170,5311]
[null,null,null,"Industrial - Food Production",0.54,0.51,0.6,0.54,0.75,0.57999999999999996,3829,3949,4927,5524,5055,3711]
[null,null,null,"Industrial - Other",0.54,0.51,0.6,0.54,0.75,0.57999999999999996,2283,3043,3530,4732,4174,5396]
[]
[]
[null,null,null,"FULL-LOAD EFFICIENCIES OF ENERGY EFFICIENT MOTORS","ROB/NC Baseline Efficiencies",null,null,null,null,null,"Early Retirement Baseline Efficiencies"]
[null,null,null,"HP","Open Motors (ODP) - 6 Pole","Open Motors (ODP) - 4 Pole","Open Motors (ODP) - 2 Pole","Closed Motors (TEFC) - 6 Pole","Closed Motors (TEFC) - 4 Pole","Closed Motors (TEFC) - 2 Pole","Open Motors (ODP) - 6 Pole","Open Motors (ODP) - 4 Pole","Open Motors (ODP) - 2 Pole","Closed Motors (TEFC) - 6 Pole","Closed Motors (TEFC) - 4 Pole","Closed Motors (TEFC) - 2 Pole"]
[null,null,null,1,0.82499999999999996,0.85499999999999998,0.77,0.82499999999999996,0.85499999999999998,0.77,0.8,0.82499999999999996,0.755,0.8,0.82499999999999996,0.755]
[null,null,null,1.5,0.86499999999999999,0.86499999999999999,0.84,0.875,0.86499999999999999,0.84,0.84,0.84,0.82499999999999996,0.85499999999999998,0.84,0.82499999999999996]
[null,null,null,2,0.875,0.86499999999999999,0.85499999999999998,0.88500000000000001,0.86499999999999999,0.85499999999999998,0.85499999999999998,0.84,0.84,0.86499999999999999,0.84,0.84]
[null,null,null,3,0.88500000000000001,0.89500000000000002,0.85499999999999998,0.89500000000000002,0.89500000000000002,0.86499999999999999,0.86499999999999999,0.86499999999999999,0.84,0.875,0.875,0.85499999999999998]
[null,null,null,5,0.89500000000000002,0.89500000000000002,0.86499999999999999,0.89500000000000002,0.89500000000000002,0.88500000000000001,0.875,0.875,0.85499999999999998,0.875,0.875,0.875]
[null,null,null,7.5,0.90200000000000002,0.91,0.88500000000000001,0.91,0.91700000000000004,0.89500000000000002,0.88500000000000001,0.88500000000000001,0.875,0.89500000000000002,0.89500000000000002,0.88500000000000001]
[null,null,null,10,0.91700000000000004,0.91700000000000004,0.89500000000000002,0.91,0.91700000000000004,0.90200000000000002,0.90200000000000002,0.89500000000000002,0.88500000000000001,0.89500000000000002,0.89500000000000002,0.89500000000000002]
[null,null,null,15,0.91700000000000004,0.93,0.90200000000000002,0.91700000000000004,0.92400000000000004,0.91,0.90200000000000002,0.91,0.89500000000000002,0.90200000000000002,0.91,0.90200000000000002]
[null,null,null,20,0.92400000000000004,0.93,0.91,0.91700000000000004,0.93,0.91,0.91,0.91,0.90200000000000002,0.90200000000000002,0.91,0.90200000000000002]
[null,null,null,25,0.93,0.93599999999999994,0.91700000000000004,0.93,0.93599999999999994,0.91700000000000004,0.91700000000000004,0.91700000000000004,0.91,0.91700000000000004,0.92400000000000004,0.91]
[null,null,null,30,0.93599999999999994,0.94099999999999995,0.91700000000000004,0.93,0.93599999999999994,0.91700000000000004,0.92400000000000004,0.92400000000000004,0.91,0.91700000000000004,0.92400000000000004,0.91]
[null,null,null,40,0.94099999999999995,0.94099999999999995,0.92400000000000004,0.94099999999999995,0.94099999999999995,0.92400000000000004,0.93,0.93,0.91700000000000004,0.93,0.93,0.91700000000000004]
[null,null,null,50,0.94099999999999995,0.94499999999999995,0.93,0.94099999999999995,0.94499999999999995,0.93,0.93,0.93,0.92400000000000004,0.93,0.93,0.92400000000000004]
[null,null,null,60,0.94499999999999995,0.95,0.93599999999999994,0.94499999999999995,0.95,0.93599999999999994,0.93599999999999994,0.93599999999999994,0.93,0.93599999999999994,0.93599999999999994,0.93]
[null,null,null,75,0.94499999999999995,0.95,0.93599999999999994,0.94499999999999995,0.95400000000000007,0.93599999999999994,0.93599999999999994,0.94099999999999995,0.93,0.93599999999999994,0.94099999999999995,0.93]
[null,null,null,100,0.95,0.95400000000000007,0.93599999999999994,0.95,0.95400000000000007,0.94099999999999995,0.94099999999999995,0.94099999999999995,0.93,0.94099999999999995,0.94499999999999995,0.93599999999999994]
[null,null,null,125,0.95,0.95400000000000007,0.94099999999999995,0.95,0.95400000000000007,0.95,0.94099999999999995,0.94499999999999995,0.93599999999999994,0.94099999999999995,0.94499999999999995,0.94499999999999995]
[null,null,null,150,0.95400000000000007,0.95799999999999996,0.94099999999999995,0.95799999999999996,0.95799999999999996,0.95,0.94499999999999995,0.95,0.93599999999999994,0.95,0.95,0.94499999999999995]
[null,null,null,200,0.95400000000000007,0.95799999999999996,0.95,0.95799999999999996,0.96200000000000008,0.95400000000000007,0.94499999999999995,0.95,0.94499999999999995,0.95,0.95,0.95]
[null,null,null,250,0.95799999999999996,0.95799999999999996,0.94,0.95799999999999996,0.96200000000000008,0.95799999999999996,0.95400000000000007,0.95400000000000007,0.94499999999999995,0.95,0.95,0.95400000000000007]
[null,null,null,300,0.95799999999999996,0.95799999999999996,0.95400000000000007,0.95799999999999996,0.96200000000000008,0.95799999999999996,0.95400000000000007,0.95400000000000007,0.95,0.95,0.95400000000000007,0.95400000000000007]
[null,null,null,350,0.95799999999999996,0.95799999999999996,0.95400000000000007,0.95799999999999996,0.96200000000000008,0.95799999999999996,0.95400000000000007,0.95400000000000007,0.95,0.95,0.95400000000000007,0.95400000000000007]
[null,null,null,400,"n/a",0.95799999999999996,0.95799999999999996,"n/a",0.96200000000000008,0.95799999999999996,"n/a",0.95400000000000007,0.95400000000000007,"n/a",0.95400000000000007,0.95400000000000007]
[null,null,null,450,"n/a",0.96200000000000008,0.96200000000000008,"n/a",0.96200000000000008,0.95799999999999996,"n/a",0.95799999999999996,0.95799999999999996,"n/a",0.95400000000000007,0.95400000000000007]
[null,null,null,500,"n/a",0.96200000000000008,0.96200000000000008,"n/a",0.96200000000000008,0.95799999999999996,"n/a",0.95799999999999996,0.95799999999999996,"n/a",0.95799999999999996,0.95400000000000007]
[]
[]
[]
[null,null,null,"Age of Replaced Motor (Years","RUL (Years)"]
[null,null,null,1,13.9]
[null,null,null,2,12.9]
[null,null,null,3,11.9]
[null,null,null,4,10.9]
[null,null,null,5,9.9]
[null,null,null,6,8.9]
[null,null,null,7,7.9]
[null,null,null,8,6.9]
[null,null,null,9,5.9]
[null,null,null,10,5]
[null,null,null,11,4.2]
[null,null,null,12,3.6]
[null,null,null,13,3]
[null,null,null,14,2.5]
[null,null,null,15,2]
[null,null,null,16,1]
[null,null,null,"17 or more",0]
[]
[null,"Pump-Off Controller"]
[null,null,null,"Stipulated Values"]
[null,null,null,"HP-kW Conversion Factor",0.746]
[null,null,null,"Motor Load Factor",0.25]
[null,null,null,"Mechanical Efficiency of Sucker Rod Pump",0.95]
[null,null,null,"Clock Timer %",0.65]
[null,null,null,"Annual Hours",8760]
[null,null,null,"Run Constant",8.3360000000000003]
[null,null,null,"Run Coefficient",0.95599999999999996]
[]
[null,"Window Film Treatment"]
[null,null,null,"Orientation","Solar Heat Gain (SHG) [Btu/ft2-year]","Peak Hour Solar Heat Gain (SHGF) [Btu/hr-ft2-year]",null,null,null,null,null,"NCP Hour Solar Heat Gain",null,null,"Existing Window Type",null,null,"COP TABLE"]
[null,null,null,null,null,"TX1","TX2","TX3","TX4","TX5","TXCPS","TXCPS",null,null,"Shading Type","SHGC",null,"Year of Construction","HVAC"]
[null,null,null,"South-East",158844,28,30,26,27,35,29,36,null,null,"Single-Pane 1/8-inch clear glass",0.86,null,null,"Air Conditioner or Heat Pump","PTAC/PTHP","Air-Cooled Chiller","Water-Cooled Chiller"]
[null,null,null,"South-South-East",134794,28,31,28,28,37,30,38,null,null,"Single-Pane 1/4-inch clear glass",0.81,null,"Before 2011",2.9,2.9,2.5,4.2]
[null,null,null,"South",120839,37,44,47,45,56,34,57,null,null,"Single-Pane 1/2-inch clear glass",0.76,null,"2011 - 2016",3.8,3.1,2.8,5.5]
[null,null,null,"South-South-West",134794,88,94,113,113,101,76,127,null,null,"Double-pane clear glass",0.7,null,"After 2016",3.8,3.1,2.8,5.5]
[null,null,null,"South-West",158844,152,151,170,173,141,139,181]
[null,null,null,"West-South-West",169696,191,184,201,206,160,181,210]
[null,null,null,"West",163006,202,189,201,207,155,195,219]
[null,null,null,"West-North-West",139615,183,167,171,178,128,181,208]
[null,null,null,"North-West",107161,136,120,115,121,85,140,176]
[]
[null,"Cool Roofs"]
[null,null,null,null,"Baseline R-Values (down) / Post R-Values (across)","R <= 13","13 < R <= 20","20 < R","R <= 13","13 < R <= 20","20 < R"]
[null,null,null,"TX1Retail","R <= 13",0.72,1.26,1.25,1.9280000000000002E-4,3.6230000000000002E-4,3.858E-4]
[null,null,null,null,"13 < R <= 20",null,0.13,0.12,"",4.8099999999999997E-5,6.4700000000000001E-5]
[null,null,null,null,"20 < R",null,null,0.09,"","",3.3200000000000001E-5]
[null,null,null,"TX1EducationChiller","R <= 13",0.65,1.1000000000000001,1.25,1.1800000000000002E-4,2.1760000000000003E-4,2.5530000000000003E-4]
[null,null,null,null,"13 < R <= 20",null,0.26,0.38,"",4.85E-5,7.7999999999999999E-5]
[null,"Dropdowns:",null,null,"20 < R",null,null,0.17,"","",3.4E-5]
[null,null,null,"TX1EducationDX","R <= 13",0.26,0.43,0.49,8.2600000000000002E-5,1.5470000000000002E-4,1.8200000000000001E-4]
[null,"Retail",null,null,"13 < R <= 20",null,0.12,0.18,"",4.110000000000001E-5,6.6700000000000009E-5]
[null,"Education (Chiller)",null,null,"20 < R",null,null,0.08,"","",2.9100000000000003E-5]
[null,"Education (DX)",null,"TX1OfficeChiller","R <= 13",0.21,0.31,0.33,6.7999999999999999E-5,3.4400000000000003E-5,1.9300000000000003E-4]
[null,"Office (Chiller)",null,null,"13 < R <= 20",null,0.09,0.11,"",1.6579999999999999E-4,5.9400000000000007E-5]
[null,"Office (DX)",null,null,"20 < R",null,null,0.06,"","",2.3600000000000001E-5]
[null,"Hotel",null,"TX1OfficeDX","R <= 13",0.28000000000000003,0.87,1.1000000000000001,7.4600000000000011E-5,1.5480000000000002E-4,1.861E-4]
[null,"Warehouse",null,null,"13 < R <= 20",null,0.15,0.38,"",4.1200000000000005E-5,6.730000000000001E-5]
[null,"Other",null,null,"20 < R",null,null,0.11,"","",2.9200000000000002E-5]
[null,null,null,"TX1Hotel","R <= 13",7.0000000000000007E-2,7.0000000000000007E-2,7.0000000000000007E-2,1.3300000000000001E-5,1.8300000000000001E-5,2.0299999999999999E-5]
[null,"PreRvalues","RRange Lkp",null,"13 < R <= 20",null,0.04,0.04,"",8.1000000000000004E-6,1.0000000000000001E-5]
[null,"R <= 13","RRange1",null,"20 < R",null,null,0.03,"","",6.0000000000000002E-6]
[null,"13 < R <= 20","RRange2","TX1Warehouse","R <= 13",0.04,0.11,0.14000000000000001,3.8300000000000003E-5,6.9900000000000005E-5,8.070000000000001E-5]
[null,"20 < R","RRange3",null,"13 < R <= 20",null,0.01,0.04,"",1.3500000000000001E-5,2.2400000000000002E-5]
[null,"Before 2011","RRange3",null,"20 < R",null,null,0.01,"","",9.0000000000000002E-6]
[null,"Between 2011 - 2016","RRange3","TX1Other","R <= 13",0.04,7.0000000000000007E-2,7.0000000000000007E-2,1.3300000000000001E-5,1.8300000000000001E-5,2.0299999999999999E-5]
[null,"After 2016","RRange3",null,"13 < R <= 20",null,0.01,0.04,"",8.1000000000000004E-6,1.0000000000000001E-5]
[null,null,null,null,"20 < R",null,null,0.01,"","",6.0000000000000002E-6]
[null,null,null,"TX2Retail","R <= 13",0.61,0.97,0.98,2.2030000000000004E-4,3.7670000000000005E-4,4.0540000000000004E-4]
[null,"RRange1",null,null,"13 < R <= 20",null,0.16,0.17,"",7.570000000000001E-5,9.6700000000000006E-5]
[null,"No significant change to R-value",null,null,"20 < R",null,null,0.13,"","",6.2200000000000008E-5]
[null,"13 < R <= 20",null,"TX2EducationChiller","R <= 13",0.56000000000000005,0.82,0.92,1.0490000000000002E-4,1.6500000000000003E-4,1.886E-4]
[null,"20 < R",null,null,"13 < R <= 20",null,0.28999999999999998,0.36,"",5.4100000000000007E-5,7.2800000000000008E-5]
[null,null,null,null,"20 < R",null,null,0.24,"","",4.3700000000000005E-5]
[null,"RRange2",null,"TX2EducationDX","R <= 13",0.27,0.39,0.43,1.0650000000000001E-4,1.8310000000000001E-4,2.1330000000000001E-4]
[null,"No significant change to R-value",null,null,"13 < R <= 20",null,0.17,0.21,"",7.2100000000000004E-5,1.0080000000000001E-4]
[null,"20 < R",null,null,"20 < R",null,null,0.13,"","",5.8800000000000006E-5]
[null,null,null,"TX2OfficeChiller","R <= 13",0.23,0.33,0.34,1.1990000000000001E-4,2.7480000000000001E-4,3.0550000000000005E-4]
[null,"RRange3",null,null,"13 < R <= 20",null,0.13,0.15,"",6.6799999999999997E-5,9.7600000000000001E-5]
[null,"No significant change to R-value",null,null,"20 < R",null,null,0.1,"","",6.0100000000000004E-5]
[null,null,null,"TX2OfficeDX","R <= 13",0.27,0.52,0.62,1.2140000000000001E-4,2.4530000000000005E-4,2.945E-4]
[null,null,null,null,"13 < R <= 20",null,0.18,0.28000000000000003,"",7.25E-5,1.1090000000000001E-4]
[null,null,null,null,"20 < R",null,null,0.15,"","",6.0300000000000009E-5]
[null,null,null,"TX2Hotel","R <= 13",7.0000000000000007E-2,7.0000000000000007E-2,7.0000000000000007E-2,1.7100000000000002E-5,2.3E-5,2.5600000000000002E-5]
[null,null,null,null,"13 < R <= 20",null,0.05,0.05,"",1.17E-5,1.4200000000000001E-5]
[null,null,null,null,"20 < R",null,null,0.05,"","",1.0100000000000002E-5]
[null,null,null,"TX2Warehouse","R <= 13",0.05,0.09,0.16,4.0099999999999999E-5,6.5400000000000004E-5,1.1160000000000002E-4]
[null,null,null,null,"13 < R <= 20",null,0.02,0.08,"",1.1800000000000001E-5,4.9400000000000008E-5]
[null,null,null,null,"20 < R",null,null,0.01,"","",1.0200000000000001E-5]
[null,null,null,"TX2Other","R <= 13",0.05,7.0000000000000007E-2,7.0000000000000007E-2,1.7100000000000002E-5,2.3E-5,2.5600000000000002E-5]
[null,null,null,null,"13 < R <= 20",null,0.02,0.05,"",1.17E-5,1.4200000000000001E-5]
[null,null,null,null,"20 < R",null,null,0.01,"","",1.0100000000000002E-5]
[null,null,null,"TX3Retail","R <= 13",0.62,1,1.01,1.7210000000000001E-4,2.9600000000000004E-4,3.1610000000000004E-4]
[null,null,null,null,"13 < R <= 20",null,0.41,0.41,"",1.043E-4,1.1890000000000002E-4]
[null,null,null,null,"20 < R",null,null,0.14000000000000001,"","",4.6600000000000008E-5]
[null,null,null,"TX3EducationChiller","R <= 13",0.62,0.87,0.95,9.5600000000000006E-5,1.528E-4,1.7530000000000003E-4]
[null,null,null,null,"13 < R <= 20",null,0.33,0.39,"",5.0400000000000005E-5,6.8100000000000002E-5]
[null,null,null,null,"20 < R",null,null,0.26,"","",4.0500000000000002E-5]
[null,null,null,"TX3EducationDX","R <= 13",0.28999999999999998,0.4,0.44,9.3900000000000019E-5,1.5760000000000001E-4,1.8260000000000002E-4]
[null,null,null,null,"13 < R <= 20",null,0.18,0.22,"",6.2100000000000005E-5,8.5800000000000012E-5]
[null,null,null,null,"20 < R",null,null,0.14000000000000001,"","",5.0800000000000002E-5]
[null,null,null,"TX3OfficeChiller","R <= 13",0.25,0.33,0.34,9.4500000000000007E-5,2.1390000000000002E-4,2.354E-4]
[null,null,null,null,"13 < R <= 20",null,0.17,0.18,"",1.0750000000000001E-4,1.284E-4]
[null,null,null,null,"20 < R",null,null,0.12,"","",4.5400000000000006E-5]
[null,null,null,"TX3OfficeDX","R <= 13",0.28000000000000003,0.46,0.54,8.3000000000000012E-5,1.8660000000000001E-4,2.2360000000000001E-4]
[null,null,null,null,"13 < R <= 20",null,0.19,0.26,"",5.4200000000000003E-5,8.3900000000000006E-5]
[null,null,null,null,"20 < R",null,null,0.15,"","",4.35E-5]
[null,null,null,"TX3Hotel","R <= 13",0.08,7.0000000000000007E-2,7.0000000000000007E-2,1.6900000000000001E-5,2.26E-5,2.5000000000000001E-5]
[null,null,null,null,"13 < R <= 20",null,0.06,0.05,"",1.2100000000000001E-5,1.43E-5]
[null,null,null,null,"20 < R",null,null,0.05,"","",1.0300000000000001E-5]
[null,null,null,"TX3Warehouse","R <= 13",0.05,0.09,0.16,2.9600000000000001E-5,5.13E-5,9.2100000000000016E-5]
[null,null,null,null,"13 < R <= 20",null,0.02,0.08,"",1.3200000000000002E-5,4.6600000000000008E-5]
[null,null,null,null,"20 < R",null,null,0.01,"","",7.9000000000000006E-6]
[null,null,null,"TX3Other","R <= 13",0.05,7.0000000000000007E-2,7.0000000000000007E-2,1.6900000000000001E-5,2.26E-5,2.5000000000000001E-5]
[null,null,null,null,"13 < R <= 20",null,0.02,0.05,"",1.2100000000000001E-5,1.43E-5]
[null,null,null,null,"20 < R",null,null,0.01,"","",7.9000000000000006E-6]
[null,null,null,"TX4Retail","R <= 13",0.62,0.99,1,1.3050000000000003E-4,2.1990000000000001E-4,2.3210000000000003E-4]
[null,null,null,null,"13 < R <= 20",null,0.41,0.41,"",8.0800000000000012E-5,8.9499999999999994E-5]
[null,null,null,null,"20 < R",null,null,0.13,"","",3.4200000000000005E-5]
[null,null,null,"TX4EducationChiller","R <= 13",0.6,0.83,0.9,8.460000000000001E-5,1.3550000000000001E-4,1.5490000000000002E-4]
[null,null,null,null,"13 < R <= 20",null,0.31,0.36,"",4.4800000000000005E-5,6.0000000000000008E-5]
[null,null,null,null,"20 < R",null,null,0.24,"","",3.6400000000000004E-5]
[null,null,null,"TX4EducationDX","R <= 13",0.28000000000000003,0.38,0.41,7.3400000000000009E-5,1.178E-4,1.3530000000000001E-4]
[null,null,null,null,"13 < R <= 20",null,0.17,0.2,"",4.6400000000000003E-5,6.2900000000000011E-5]
[null,null,null,null,"20 < R",null,null,0.14000000000000001,"","",3.7700000000000002E-5]
[null,null,null,"TX4OfficeChiller","R <= 13",0.22,0.31,0.32,6.4400000000000007E-5,1.3550000000000001E-4,1.5300000000000003E-4]
[null,null,null,null,"13 < R <= 20",null,0.17,0.18,"",6.340000000000001E-5,7.960000000000001E-5]
[null,null,null,null,"20 < R",null,null,0.1,"","",3.2700000000000002E-5]
[null,null,null,"TX4OfficeDX","R <= 13",0.26,0.4,0.45,5.02E-5,8.6600000000000004E-5,1.0090000000000001E-4]
[null,null,null,null,"13 < R <= 20",null,0.18,0.24,"",3.6100000000000003E-5,4.8300000000000002E-5]
[null,null,null,null,"20 < R",null,null,0.15,"","",2.9500000000000006E-5]
[null,null,null,"TX4Hotel","R <= 13",7.0000000000000007E-2,7.0000000000000007E-2,7.0000000000000007E-2,1.13E-5,1.4400000000000001E-5,1.5700000000000002E-5]
[null,null,null,null,"13 < R <= 20",null,0.05,0.05,"",7.8000000000000016E-6,9.0000000000000002E-6]
[null,null,null,null,"20 < R",null,null,0.04,"","",6.7000000000000011E-6]
[null,null,null,"TX4Warehouse","R <= 13",0.05,0.09,0.16,2.1000000000000002E-5,3.5099999999999999E-5,6.5400000000000004E-5]
[null,null,null,null,"13 < R <= 20",null,0.02,0.08,"",1.2100000000000001E-5,3.7100000000000001E-5]
[null,null,null,null,"20 < R",null,null,0.01,"","",6.9999999999999999E-6]
[null,null,null,"TX4Other","R <= 13",0.05,7.0000000000000007E-2,7.0000000000000007E-2,1.13E-5,1.4400000000000001E-5,1.5700000000000002E-5]
[null,null,null,null,"13 < R <= 20",null,0.02,0.05,"",7.8000000000000016E-6,9.0000000000000002E-6]
[null,null,null,null,"20 < R",null,null,0.01,"","",6.7000000000000011E-6]
[null,null,null,"TX5Retail","R <= 13",0.67,1.01,1.02,1.6550000000000001E-4,2.6850000000000002E-4,2.8780000000000006E-4]
[null,null,null,null,"13 < R <= 20",null,0.19,0.19,"",5.8300000000000008E-5,7.2400000000000012E-5]
[null,null,null,null,"20 < R",null,null,0.15,"","",4.7400000000000007E-5]
[null,null,null,"TX5EducationChiller","R <= 13",0.69,0.97,1.07,9.09E-5,1.4420000000000001E-4,1.652E-4]
[null,null,null,null,"13 < R <= 20",null,0.36,0.44,"",4.8000000000000001E-5,6.4700000000000001E-5]
[null,null,null,null,"20 < R",null,null,0.28000000000000003,"","",3.9100000000000002E-5]
[null,null,null,"TX5EducationDX","R <= 13",0.3,0.42,0.46,8.2100000000000017E-5,1.3430000000000001E-4,1.5490000000000002E-4]
[null,null,null,null,"13 < R <= 20",null,0.18,0.22,"",5.1600000000000007E-5,7.0900000000000002E-5]
[null,null,null,null,"20 < R",null,null,0.14000000000000001,"","",4.1400000000000003E-5]
[null,null,null,"TX5OfficeChiller","R <= 13",0.28999999999999998,0.39,0.42,9.7200000000000018E-5,1.7570000000000002E-4,2.0350000000000004E-4]
[null,null,null,null,"13 < R <= 20",null,0.17,0.2,"",6.6799999999999997E-5,9.2200000000000018E-5]
[null,null,null,null,"20 < R",null,null,0.14000000000000001,"","",5.3900000000000002E-5]
[null,null,null,"TX5OfficeDX","R <= 13",0.31,0.55000000000000004,0.64,9.9300000000000001E-5,1.6570000000000002E-4,1.9260000000000002E-4]
[null,null,null,null,"13 < R <= 20",null,0.2,0.28999999999999998,"",5.7500000000000002E-5,7.7800000000000007E-5]
[null,null,null,null,"20 < R",null,null,0.16,"","",4.7000000000000004E-5]
[null,null,null,"TX5Hotel","R <= 13",0.1,0.08,0.08,1.3300000000000001E-5,1.5800000000000001E-5,1.6800000000000002E-5]
[null,null,null,null,"13 < R <= 20",null,7.0000000000000007E-2,0.06,"",9.5000000000000005E-6,1.04E-5]
[null,null,null,null,"20 < R",null,null,0.06,"","",8.1000000000000004E-6]
[null,null,null,"TX5Warehouse","R <= 13",0.04,0.09,0.15,2.76E-5,4.9100000000000008E-5,8.2700000000000004E-5]
[null,null,null,null,"13 < R <= 20",null,0.02,7.0000000000000007E-2,"",1.3100000000000002E-5,3.9800000000000005E-5]
[null,null,null,null,"20 < R",null,null,0.01,"","",7.6000000000000009E-6]
[null,null,null,"TX5Other","R <= 13",0.04,0.08,0.08,1.3300000000000001E-5,1.5800000000000001E-5,1.6800000000000002E-5]
[null,null,null,null,"13 < R <= 20",null,0.02,0.06,"",9.5000000000000005E-6,1.04E-5]
[null,null,null,null,"20 < R",null,null,0.01,"","",7.6000000000000009E-6]
[null,null,null,"TXCPSRetail","R <= 13",0.67,1.08,1.1000000000000001,2.3070000000000002E-4,3.991E-4,4.2660000000000002E-4]
[null,null,null,null,"13 < R <= 20",null,0.43,0.44,null,1.3860000000000001E-4,1.585E-4]
[null,null,null,null,"20 < R",null,null,0.15,null,0,6.1100000000000008E-5]
[null,null,null,"TXCPSEducationChiller","R <= 13",0.66,0.93,1.06,1.4250000000000002E-4,2.3790000000000001E-4,2.7750000000000002E-4]
[null,null,null,null,"13 < R <= 20",null,0.35,0.42,null,7.9000000000000009E-5,1.103E-4]
[null,null,null,null,"20 < R",null,null,0.28000000000000003,null,null,6.6400000000000001E-5]
[null,null,null,"TXCPSEducationDX","R <= 13",0.32,0.46,0.51,1.1930000000000001E-4,2.1960000000000003E-4,2.5080000000000002E-4]
[null,null,null,null,"13 < R <= 20",null,0.2,0.25,null,8.4400000000000005E-5,1.144E-4]
[null,null,null,null,"20 < R",null,null,0.16,null,null,6.3800000000000006E-5]
[null,null,null,"TXCPSOfficeChiller","R <= 13",0.26,0.33,0.37,1.127E-4,2.2190000000000003E-4,2.4960000000000005E-4]
[null,null,null,null,"13 < R <= 20",null,0.14000000000000001,0.18,null,9.3700000000000001E-5,1.1910000000000001E-4]
[null,null,null,null,"20 < R",null,null,0.16,null,null,4.9700000000000002E-5]
[null,null,null,"TXCPSOfficeDX","R <= 13",0.31,0.51,0.6,1.0950000000000001E-4,1.9300000000000003E-4,2.2920000000000004E-4]
[null,null,null,null,"13 < R <= 20",null,0.2,0.28000000000000003,null,6.6799999999999997E-5,9.3900000000000019E-5]
[null,null,null,null,"20 < R",null,null,0.16,null,null,5.4900000000000006E-5]
[null,null,null,"TXCPSHotel","R <= 13",0.08,0.08,0.08,1.9000000000000001E-5,2.51E-5,2.7800000000000001E-5]
[null,null,null,null,"13 < R <= 20",null,0.06,0.06,null,1.3500000000000001E-5,1.6000000000000003E-5]
[null,null,null,null,"20 < R",null,null,0.05,null,null,1.1600000000000001E-5]
[null,null,null,"TXCPSWarehouse","R <= 13",0.06,0.11,0.19,4.1500000000000006E-5,7.1500000000000003E-5,1.2050000000000002E-4]
[null,null,null,null,"13 < R <= 20",null,0.03,0.09,null,1.9600000000000002E-5,5.9300000000000005E-5]
[null,null,null,null,"20 < R",null,null,0.01,null,null,1.3400000000000002E-5]
[null,null,null,"TXCPSOther","R <= 13",0.06,0.08,0.08,1.9000000000000001E-5,2.51E-5,2.7800000000000001E-5]
[null,null,null,null,"13 < R <= 20",null,0.03,0.06,null,1.3500000000000001E-5,1.6000000000000003E-5]
[null,null,null,null,"20 < R",null,null,0.01,null,null,1.1600000000000001E-5]
[]
[null,"Door Air Infiltration"]
[null,null,null,null,"Cooling Energy kWh/ft",null,null,null,"Electric Resistance Heating Energy kWh/ft",null,null,null,"Heat Pump Heating Energy kWh/ft",null,null,null,"No Heating - Summer Demand kW/ft",null,null,null,"Electric Resistance Heating Winter Demand kW/ft",null,null,null,"Heat Pump Heating Winter Demand kW/ft",null,null,null,"NCP kW/ft"]
[null,null,null,null,0.125,0.25,0.5,0.75,"1/8","1/4","1/2","3/4","1/8","1/4","1/2","3/4","1/8","1/4","1/2","3/4","1/8","1/4","1/2","3/4","1/8","1/4","1/2","3/4","1/8","1/4","1/2","3/4"]
[null,null,null,"TX1",1.9,3.83,7.6,11.42,101.26,204.24,405.72,609.04999999999995,30.69,61.89,122.94,184.56,5.3E-3,1.0500000000000001E-2,2.1000000000000001E-2,3.15E-2,2.6800000000000001E-2,5.4100000000000002E-2,0.1074,0.16120000000000001,1.38E-2,2.7699999999999999E-2,5.5E-2,8.2500000000000004E-2]
[null,null,null,"TX2",3.9,7.88,15.65,23.49,48.9,98.82,196.15,294.44,14.82,29.95,59.44,89.22,4.4000000000000003E-3,8.9999999999999993E-3,1.7899999999999999E-2,2.69E-2,4.1200000000000001E-2,8.2799999999999999E-2,0.1648,0.24740000000000001,1.78E-2,3.5700000000000003E-2,7.0999999999999994E-2,0.1066]
[null,"Electric Resistance",null,"TX3",3.01,6.09,12.09,18.14,27.18,55.06,109.19,163.91,8.24,16.690000000000001,33.090000000000003,49.67,4.3E-3,8.6999999999999994E-3,1.7299999999999999E-2,2.5899999999999999E-2,2.1100000000000001E-2,4.2500000000000003E-2,8.4400000000000003E-2,0.12670000000000001,1.0200000000000001E-2,2.07E-2,4.1000000000000002E-2,6.1499999999999999E-2]
[null,"Heat Pump",null,"TX4",5,10.08,20.03,30.06,22.78,46.02,91.35,137.13,6.9,13.94,27.68,41.56,4.1000000000000003E-3,8.2000000000000007E-3,1.6400000000000001E-2,2.46E-2,1.9E-2,3.8300000000000001E-2,7.6200000000000004E-2,0.1144,8.6999999999999994E-3,1.7500000000000002E-2,3.4799999999999998E-2,5.2299999999999999E-2]
[null,"Gas or None",null,"TX5",2.81,5.69,11.28,16.93,45.59,92.23,182.99,274.69,13.81,27.95,55.45,83.24,4.1000000000000003E-3,8.3000000000000001E-3,1.6500000000000001E-2,2.47E-2,9.9000000000000008E-3,2.0199999999999999E-2,0.04,6.0199999999999997E-2,4.8999999999999998E-3,9.9000000000000008E-3,1.9699999999999999E-2,2.9600000000000001E-2]
[null,null,null,"TXCPS",4.83,9.7799999999999994,19.399999999999999,29.12,31.96,65.650000000000006,128.27000000000001,192.56,9.68,19.59,38.869999999999997,58.35,6.0000000000000001E-3,1.21E-2,2.4E-2,3.5999999999999997E-2,0,0,0,0,0,0,0,0,8.6999999999999994E-3,1.7500000000000002E-2,3.49E-2,5.2299999999999999E-2]
[]
[]
[null,"PC Power Management",null,null,"TX","CPS","TX1","TX2","TX3","TX4","TX5","TXCPS","TXCPS"]
[null,null,null,"Equipment","kWh","kWh","Peak kW","Peak kW","Peak kW","Peak kW","Peak kW","Peak kW","NCP kW"]
[null,null,null,"Conventional LCD Monitor",62.6,62.6,6.0000000000000001E-3,7.0000000000000001E-3,6.0000000000000001E-3,7.0000000000000001E-3,4.0000000000000001E-3,1.2999999999999999E-2,1.9E-2]
[null,"Office",null,"Conventional Computer",161.4,161,1.6E-2,1.7000000000000001E-2,1.4999999999999999E-2,1.7000000000000001E-2,1.0999999999999999E-2,3.5999999999999997E-2,5.0999999999999997E-2]
[null,"School",null,"Conventional Notebook",48.2,48.1,5.0000000000000001E-3,5.0000000000000001E-3,5.0000000000000001E-3,5.0000000000000001E-3,3.0000000000000001E-3,1.2E-2,1.7000000000000001E-2]
[null,null,null,"ENERGY STAR Monitor",51.3,51.2,5.0000000000000001E-3,6.0000000000000001E-3,5.0000000000000001E-3,6.0000000000000001E-3,4.0000000000000001E-3,1.0999999999999999E-2,1.6E-2]
[null,null,null,"ENERGY STAR Computer",89.5,89.3,8.9999999999999993E-3,0.01,8.9999999999999993E-3,0.01,6.0000000000000001E-3,2.1000000000000001E-2,0.03]
[null,null,null,"ENERGY STAR Notebook",27.5,27.4,3.0000000000000001E-3,3.0000000000000001E-3,3.0000000000000001E-3,3.0000000000000001E-3,2E-3,7.0000000000000001E-3,0.01]
[]
[null,"DHW Controls"]
[null,null,null,"Circulation Pump Savings"]
[null,null,null,null,null,null,"Summer kW Savings (Lodging only)",null,null,null,null,null,"Winter kW Savings (Lodging only)"]
[null,null,null,"Pump Size (watts)","Assumed Wattage","Annual Pump kWh Savings","TX1","TX2","TX3","TX4","TX5","TXCPS","TX1","TX2","TX3","TX4","TX5","TXCPS"]
[null,null,null,"≤ 50",50,407,4.9000000000000002E-2,4.9000000000000002E-2,4.9000000000000002E-2,4.9000000000000002E-2,4.9000000000000002E-2,4.9000000000000002E-2,6.0999999999999999E-2,5.7000000000000002E-2,6.0999999999999999E-2,6.0999999999999999E-2,5.7000000000000002E-2,0]
[null,"Lodging - Low Rise",null,"50 < W < 100",75,611,7.2999999999999995E-2,7.2999999999999995E-2,7.2999999999999995E-2,7.2999999999999995E-2,7.2999999999999995E-2,7.2999999999999995E-2,9.1999999999999998E-2,8.5999999999999993E-2,9.1999999999999998E-2,9.1999999999999998E-2,8.5999999999999993E-2,0]
[null,"Lodging - High Rise",null,"100 ≤ W < 150",125,1018,0.122,0.122,0.122,0.122,0.122,0.122,0.153,0.14299999999999999,0.153,0.153,0.14299999999999999,0]
[null,null,null,"≥ 150",150,1222,0.14699999999999999,0.14699999999999999,0.14699999999999999,0.14699999999999999,0.14699999999999999,0.14699999999999999,0.183,0.17100000000000001,0.183,0.183,0.17100000000000001,0]
[]
[]
[null,null,null,"Thermal Savings"]
[null,null,null,null,"Electric ResistanceLodging - Low RisekWh","Electric ResistanceLodging - High RisekWh","Heat PumpLodging - Low RisekWh","Heat PumpLodging - High RisekWh","Electric ResistanceLodging - Low RisekWs","Electric ResistanceLodging - High RisekWs","Heat PumpLodging - Low RisekWs","Heat PumpLodging - High RisekWs","Electric ResistanceLodging - Low RisekWw","Electric ResistanceLodging - High RisekWw","Heat PumpLodging - Low RisekWw","Heat PumpLodging - High RisekWw"]
[null,null,null,"TX1",1007,620,395,243,0.12,7.0000000000000007E-2,0.05,0.03,0.15,0.09,0.06,0.04]
[null,null,null,"TX2",566,349,222,137,7.0000000000000007E-2,0.04,0.03,0.02,0.08,0.05,0.03,0.02]
[null,null,null,"TX3",372,229,146,90,0.04,0.03,0.02,0.01,0.06,0.03,0.02,0.01]
[null,null,null,"TX4",249,153,98,60,0.03,0.02,0.01,0.01,0.04,0.02,0.01,0.01]
[null,null,null,"TX5",590,364,231,143,7.0000000000000007E-2,0.04,0.03,0.02,0.08,0.05,0.03,0.02]
[null,null,null,"TXCPS",372,229,146,90,0.04,0.03,0.02,0.01,0,0,0,0]
[]
[null,"Aerators",null,"Water Heater Type","Water Heater Eff","TS"]
[null,null,null,"Electric Resistance",0.98,{"$f":"INDEX(J728:J733,MATCH(State&SelectedZone,I728:I733,0))","v":77.2}]
[null,null,null,"Heat pump",2.2000000000000002]
[null,null,null,null,null,null,null,null,"TX1",62.9]
[null,null,null,"Building Type","U","Days","P",null,"TX2",71.8]
[null,null,null,"Prison",30,365,0.04,null,"TX3",74.7]
[null,null,null,"Hospital/Nursing Home",3,365,0.03,null,"TX4",77.2]
[null,null,null,"Dormitory",30,274,0.04,null,"TX5",70.400000000000006]
[null,null,null,"Multifamily",3,365,0.03,null,"TXCPS",75.900000000000006]
[null,null,null,"Lodging",3,365,0.02]
[null,null,null,"Commercial",30,250,0.08]
[null,null,null,"School",30,200,0.05]
[]
[null,"Showerheads",null,"Building Type","Days","N","P",null,"State","TXCPS"]
[null,null,null,"Hospital/Nursing Home",365,0.89,0.03,null,"Fhw",0.66900000000000004]
[null,null,null,"Hospitality",365,1.25,0.02,null,{"$f":"INDEX(J739:J739,1,MATCH(State&SelectedZone,J738:J738,0))","v":{"$error":"#N/A"}}]
[null,null,null,"Commercial",250,0.97,0.08]
[null,null,null,"24-Hour Fitness Center",365,19.940000000000001,0.08]
[null,null,null,"School",200,1.32,0.05]
[]
[null,"Temperature-Sensitive Restrictor Valves",null,"Lookup","V Saved",null,"Zone","Tsupply Avg","Tsupply Summer","TSupplyWinter","Peak Coincidence Factor (SUMR)","Peak Coincidence Factor (WNTR)"]
[null,null,null,"Showerhead Only1.5",910,null,"TX1",62.9,73.8,53.7,3.9E-2,7.2999999999999995E-2]
[null,null,null,"Showerhead Only1.75",1062,null,"TX2",71.8,84,60.6,3.5000000000000003E-2,7.4999999999999997E-2]
[null,"Showerhead Only",null,"Showerhead Only2",1213,null,"TX3",74.7,84.5,65.5,3.7999999999999999E-2,0.08]
[null,"Tub Spout & Showerhead Combo",null,"Showerhead Only2.5",1516,null,"TX4",77.2,86.1,68.5,3.7999999999999999E-2,6.8000000000000005E-2]
[null,null,null,"Tub Spout & Showerhead Combo1.5",3700,null,"TX5",70.400000000000006,81.5,60.4,2.8000000000000001E-2,6.9000000000000006E-2]
[null,1.5,null,"Tub Spout & Showerhead Combo1.75",3791,"*Zone 3 for CPS","TXCPS",75.900000000000006,84.5,65.5,3.7999999999999999E-2,0.08]
[null,1.75,null,"Tub Spout & Showerhead Combo2",3882]
[null,2,null,"Tub Spout & Showerhead Combo2.5",4064]
[null,2.5]
[]
[null,"Electric Vehicle Supply Equipment",null,"Energy Savings per unit:",19.7]
[null,null,null,null,"Public",null,"Workplace",null,"Fleet"]
[null,null,null,"Zone","Summer Peak kW","Winter Peak kW","Summer Peak kW","Winter Peak kW","Summer Peak kW","Winter Peak kW"]
[null,null,null,"TX1",1.1999999999999999E-3,1.1999999999999999E-3,2.2000000000000001E-3,1.9E-3,8.0000000000000004E-4,1.1999999999999999E-3]
[null,"Public",null,"TX2",1.1999999999999999E-3,1.1999999999999999E-3,2.2000000000000001E-3,1.9E-3,5.9999999999999995E-4,1.1999999999999999E-3]
[null,"Workplace",null,"TX3",1.1999999999999999E-3,1.1000000000000001E-3,2.2000000000000001E-3,1.6999999999999999E-3,6.9999999999999999E-4,1E-3]
[null,"Fleet",null,"TX4",1.1999999999999999E-3,1.2999999999999999E-3,2.2000000000000001E-3,2E-3,6.9999999999999999E-4,1.4E-3]
[null,null,null,"TX5",1.1000000000000001E-3,1.2999999999999999E-3,2.0999999999999999E-3,2.3E-3,4.0000000000000002E-4,1.6000000000000001E-3]
[null,null,"Zone 3 for CPS","TXCPS",{"$f":"E761","v":1.1999999999999999E-3},0,{"$f":"G761","v":2.2000000000000001E-3},0,6.9999999999999999E-4,0]
[]
[null,"LED Traffic Signals",null,"Fixture Type","kW Savings","kWh Savings"]
[null,null,null,"8\" Red Ball",4.2000000000000003E-2,370]
[null,null,null,"8\" Green Ball",3.3000000000000002E-2,285]
[null,null,null,"8\" Yellow Ball",2E-3,19]
[null,null,null,"12\" Red Ball",7.4999999999999997E-2,655]
[null,null,null,"12\" Green Ball",5.8999999999999997E-2,514]
[null,null,null,"12\" Yellow Ball",4.0000000000000001E-3,37]
[null,null,null,"8\" Red Arrow",4.5999999999999999E-2,401]
[null,null,null,"8\" Green Arrow",1.2999999999999999E-2,111]
[null,null,null,"8\" Yellow Arrow",4.0000000000000001E-3,31]
[null,null,null,"12\" Red Arrow",0.107,936]
[null,null,null,"12\" Green Arrow",0.01,86]
[null,null,null,"12\" Yellow Arrow",4.0000000000000001E-3,31]
[null,null,null,"Large (16\"x18\") Pedestrian Signal",0.13800000000000001,1210]
[null,null,null,"Small (12\"x12\") Pedestrian Signal",9.7000000000000003E-2,847]
[]
[null,"VFD for water pumping",null,"Zone","kWh per HP","Winter kW per HP"]
[null,null,null,"TX1",1389,9.7000000000000003E-2]
[null,null,null,"TX2",1389,6.9000000000000006E-2]
[null,null,null,"TX3",1389,6.7000000000000004E-2]
[null,null,null,"TX4",1389,0.13800000000000001]
[null,null,null,"TX5",1389,0.106]
[null,null,null,"TXCPS",1389,0]
[]
[]
[null,"Hydraulic Oils",null,"Equipment Type","EI"]
[null,null,null,"Gearbox",0.01]
[null,null,null,"Hydraulic Equipment",3.2000000000000001E-2]
[]
[null,null,null,"Motor Size","Motor Efficiency"]
[null,null,null,1,0.85499999999999998]
[null,null,null,2,0.86499999999999999]
[null,null,null,3,0.89500000000000002]
[null,null,null,5,0.89500000000000002]
[null,null,null,7.5,0.91]
[null,null,null,10,0.91700000000000004]
[null,null,null,15,0.93]
[null,null,null,20,0.93]
[null,null,null,25,0.93600000000000005]
[null,null,null,30,0.94099999999999995]
[null,null,null,40,0.94099999999999995]
[null,null,null,50,0.94499999999999995]
[null,null,null,60,0.95]
[null,null,null,75,0.95]
[null,null,null,100,0.95399999999999996]
[]
[null,"Steam Trap Repair/Replace",null,"Steam system","Climate zone","Annual kWh savings (per trap, without audit)","Annual kWh savings (per trap with audit)"]
[null,null,null,"Commercial dry cleaners","All",3.3,12.4]
[null,null,null,"Industrial or process low pressure < 15 psig","All",2.5,15.8]
[null,null,null,"Industrial or process medium pressure > 15 and < 30 psig","All",2.4,15]
[null,null,null,"Industrial or process medium pressure > 30 and < 75 psig","All",8.6,53.4]
[null,null,null,"Industrial or process high pressure > 75 and < 125 psig","All",16,100.2]
[null,null,null,"Industrial or process high pressure > 125 and < 175 psig","All",22.3,139.19999999999999]
[null,null,null,"Industrial or process high pressure > 175 and < 250 psig","All",30,187.7]
[null,null,null,"Industrial or process high pressure > 250 and < 300 psig","All",38.5,240.5]
[null,null,null,"Commercial heating Low-Pressure Steam","TX1",2.2999999999999998,8.6999999999999993]
[null,null,null,null,"TX2",1.3,4.9000000000000004]
[null,null,null,null,"TX3",0.9,3.2]
[null,null,null,null,"TX4",0.6,2.2000000000000002]
[null,null,null,null,"TX5",1.4,5.0999999999999996]
[]
[null,null,null,null,null,"Without Audit",null,null,null,null,"With Audit"]
[null,null,null,"Activity/Building Type","TX1","TX2","TX3","TX4","TX5","TX1","TX2","TX3","TX4","TX5"]
[null,null,null,"Commercial dry cleaners",1.3600000000000001E-3,7.5699999999999997E-4,5.9199999999999997E-4,3.0299999999999999E-4,3.5799999999999997E-4,5.0499999999999998E-3,2.8E-3,2.1900000000000001E-3,1.1199999999999999E-3,1.33E-3]
[null,null,null,"Industrial or process low pressure < 15 psig",3.0499999999999999E-4,3.0499999999999999E-4,3.0499999999999999E-4,3.0499999999999999E-4,3.0499999999999999E-4,1.91E-3,1.91E-3,1.91E-3,1.91E-3,1.91E-3]
[null,null,null,"Industrial or process medium pressure > 15 and < 30 psig",2.8899999999999998E-4,2.8899999999999998E-4,2.8899999999999998E-4,2.8899999999999998E-4,2.8899999999999998E-4,1.81E-3,1.81E-3,1.81E-3,1.81E-3,1.81E-3]
[null,null,null,"Industrial or process medium pressure > 30 and < 75 psig",1.0300000000000001E-3,1.0300000000000001E-3,1.0300000000000001E-3,1.0300000000000001E-3,1.0300000000000001E-3,6.45E-3,6.45E-3,6.45E-3,6.45E-3,6.45E-3]
[null,null,null,"Industrial or process high pressure > 75 and < 125 psig",1.9400000000000001E-3,1.9400000000000001E-3,1.9400000000000001E-3,1.9400000000000001E-3,1.9400000000000001E-3,1.21E-2,1.21E-2,1.21E-2,1.21E-2,1.21E-2]
[null,null,null,"Industrial or process high pressure > 125 and < 175 psig",2.6900000000000001E-3,2.6900000000000001E-3,2.6900000000000001E-3,2.6900000000000001E-3,2.6900000000000001E-3,1.6799999999999999E-2,1.6799999999999999E-2,1.6799999999999999E-2,1.6799999999999999E-2,1.6799999999999999E-2]
[null,null,null,"Industrial or process high pressure > 175 and < 250 psig",3.63E-3,3.63E-3,3.63E-3,3.63E-3,3.63E-3,2.2700000000000001E-2,2.2700000000000001E-2,2.2700000000000001E-2,2.2700000000000001E-2,2.2700000000000001E-2]
[null,null,null,"Industrial or process high pressure > 250 and < 300 psig",4.6499999999999996E-3,4.6499999999999996E-3,4.6499999999999996E-3,4.6499999999999996E-3,4.6499999999999996E-3,2.9000000000000001E-2,2.9000000000000001E-2,2.9000000000000001E-2,2.9000000000000001E-2,2.9000000000000001E-2]
[null,null,null,"Data Center",0,0,0,0,0,0,0,0,0,0]
[null,null,null,"College/University",0,0,0,0,0,0,0,0,0,0]
[null,null,null,"Primary School",2.2100000000000001E-4,3.39E-4,2.5700000000000001E-4,1.54E-4,1.9000000000000001E-4,8.1899999999999996E-4,1.2600000000000001E-3,9.5299999999999996E-4,5.7200000000000003E-4,7.0500000000000001E-4]
[null,null,null,"Secondary School",2.2100000000000001E-4,3.0299999999999999E-4,2.7799999999999998E-4,1.8000000000000001E-4,2.2100000000000001E-4,8.1899999999999996E-4,1.1199999999999999E-3,1.0300000000000001E-3,6.6699999999999995E-4,8.1899999999999996E-4]
[null,null,null,"Convenience",0,0,0,0,0,0,0,0,0,0]
[null,null,null,"Supermarket",0,0,0,0,0,0,0,0,0,0]
[null,null,null,"Full-Service Restaurant",2.2100000000000001E-4,2.5700000000000001E-4,2.2599999999999999E-4,1.8000000000000001E-4,1.44E-4,8.1899999999999996E-4,9.5299999999999996E-4,8.3799999999999999E-4,6.6699999999999995E-4,5.3300000000000005E-4]
[null,null,null,"24-Hour Full-Service Restaurant",2.2100000000000001E-4,2.52E-4,2.2599999999999999E-4,1.85E-4,1.3899999999999999E-4,8.1899999999999996E-4,9.3400000000000004E-4,8.3799999999999999E-4,6.8599999999999998E-4,5.1400000000000003E-4]
[null,null,null,"Quick-Service Restaurant",2.4699999999999999E-4,3.1399999999999999E-4,2.6200000000000003E-4,1.75E-4,1.34E-4,9.1399999999999999E-4,1.16E-3,9.7199999999999999E-4,6.4800000000000003E-4,4.95E-4]
[null,null,null,"24-Hour Quick-Service Restaurant",2.4699999999999999E-4,3.0899999999999998E-4,2.5700000000000001E-4,1.75E-4,1.34E-4,9.1399999999999999E-4,1.14E-3,9.5299999999999996E-4,6.4800000000000003E-4,4.95E-4]
[null,null,null,"Hospital",0,0,0,0,0,0,0,0,0,0]
[null,null,null,"Outpatient Healthcare",1.3899999999999999E-4,1.44E-4,1.4899999999999999E-4,4.1199999999999999E-5,2.0599999999999999E-5,5.1400000000000003E-4,5.3300000000000005E-4,5.5199999999999997E-4,1.5200000000000001E-4,7.6199999999999995E-5]
[null,null,null,"Midrise Apartment",0,0,0,0,0,0,0,0,0,0]
[null,null,null,"Large Hotel",4.4200000000000001E-4,4.2200000000000001E-4,1.7000000000000001E-4,1.08E-4,1.08E-4,1.64E-3,1.56E-3,6.29E-4,4.0000000000000002E-4,4.0000000000000002E-4]
[null,null,null,"Nursing Home",0,0,0,0,0,0,0,0,0,0]
[null,null,null,"Small Hotel/Motel",1.85E-4,2.1599999999999999E-4,9.7700000000000003E-5,5.1400000000000003E-5,3.0899999999999999E-5,6.8599999999999998E-4,8.0000000000000004E-4,3.6200000000000002E-4,1.9100000000000001E-4,1.1400000000000001E-4]
[null,null,null,"Stand-Alone Retail",5.0900000000000001E-4,2.8299999999999999E-4,2.2100000000000001E-4,1.13E-4,1.34E-4,1.89E-3,1.0499999999999999E-3,8.1899999999999996E-4,4.1899999999999999E-4,4.95E-4]
[null,null,null,"24-Hour Stand-Alone Retail",2.2100000000000001E-4,2.9300000000000002E-4,2.1100000000000001E-4,1.2899999999999999E-4,1.44E-4,8.1899999999999996E-4,1.09E-3,7.8100000000000001E-4,4.7600000000000002E-4,5.3300000000000005E-4]
[null,null,null,"Strip Mall",2.0100000000000001E-4,2.8299999999999999E-4,2.1599999999999999E-4,1.08E-4,1.3899999999999999E-4,7.4299999999999995E-4,1.0499999999999999E-3,8.0000000000000004E-4,4.0000000000000002E-4,5.1400000000000003E-4]
[null,null,null,"Large Office",0,0,0,0,0,0,0,0,0,0]
[null,null,null,"Medium Office",3.6999999999999999E-4,3.39E-4,2.1599999999999999E-4,1.2300000000000001E-4,1.3899999999999999E-4,1.3699999999999999E-3,1.2600000000000001E-3,8.0000000000000004E-4,4.57E-4,5.1400000000000003E-4]
[null,null,null,"Small Office",1.4899999999999999E-4,2.0599999999999999E-4,1.44E-4,7.2000000000000002E-5,7.7200000000000006E-5,5.5199999999999997E-4,7.6199999999999998E-4,5.3300000000000005E-4,2.6699999999999998E-4,2.8600000000000001E-4]
[null,null,null,"Public Assembly",0,0,0,0,0,0,0,0,0,0]
[null,null,null,"Religious Worship",0,0,0,0,0,0,0,0,0,0]
[null,null,null,"Service",0,0,0,0,0,0,0,0,0,0]
[null,null,null,"Warehouse",0,0,0,0,0,0,0,0,0,0]
[null,null,null,"Other",1.3899999999999999E-4,1.44E-4,9.7700000000000003E-5,4.1199999999999999E-5,2.0599999999999999E-5,5.1400000000000003E-4,5.3300000000000005E-4,3.6200000000000002E-4,1.5200000000000001E-4,7.6199999999999995E-5]
[]
[null,null,null,null,null,"kW savings"]
[null,"Hand Dryers",null,"Building Type","kWh savings","TX1","TX2","TX3","TX4","TX5","TXCPS"]
[null,null,null,"Office",223,5.43,5.49,5.37,5.62,5.62,5.37]
[null,null,null,"Warehouse",223,4.93,5.05,4.93,4.99,5.3,4.93]
[null,null,null,"Grocery (Small)",1468,5.62,5.62,5.62,5.62,5.62,5.62]
[null,null,null,"Restaurant",1468,5.62,5.62,5.62,5.62,5.62,5.62]
[null,null,null,"Retail (Small)",1468,5.62,5.62,5.62,5.62,5.62,5.62]
[null,null,null,"Conference Center",2118,4.0599999999999996,4.0599999999999996,4.0599999999999996,4.0599999999999996,4.0599999999999996,4.0599999999999996]
[null,null,null,"School",2118,2.4300000000000002,2.4300000000000002,5.62,5.43,2.5,5.62]
[null,null,null,"Stadium",2118,4.0599999999999996,4.0599999999999996,4.0599999999999996,4.0599999999999996,4.0599999999999996,4.0599999999999996]
[null,null,null,"Theater",2118,4.0599999999999996,4.0599999999999996,4.0599999999999996,4.0599999999999996,4.0599999999999996,4.0599999999999996]
[null,null,null,"University",2118,5.62,5.62,5.62,5.62,5.62,5.62]
[null,null,null,"Grocery (Large)",3262,8.65,8.65,8.65,8.65,8.65,8.65]
[null,null,null,"Retail (Large)",3262,8.65,8.65,8.65,8.65,8.65,8.65]
[null,null,null,"Airport",16312,5.62,5.62,5.62,5.62,5.62,5.62]
[null,null,null,"Transportation Center",16312,5.62,5.62,5.62,5.62,5.62,5.62]

{"sheet":"County to Zone","index":12,"n_rows":257,"n_cols":5,"rows_kept":257,"cut":false,"hidden":true,"merged":[]}
["TX",null,null,"Selected Zone:",{"$f":"IF(Utility=\"CPS Energy\",\"CPS\",INDEX(INDIRECT(State&\"ZONE\"),MATCH(County,INDIRECT(State&\"ZONE[County]\"),0),2))","v":4}]
["County","Zone"]
["Anderson",2]
["Andrews",2]
["Angelina",2]
["Aransas",4]
["Archer",2]
["Armstrong",1]
["Atascosa",3]
["Austin",3]
["Bailey",1]
["Bandera",2]
["Bastrop",3]
["Baylor",2]
["Bee",3]
["Bell",2]
["Bexar",3]
["Blanco",2]
["Borden",2]
["Bosque",2]
["Bowie",2]
["Brazoria",3]
["Brazos",3]
["Brewster",2]
["Briscoe",1]
["Brooks",4]
["Brown",2]
["Burleson",3]
["Burnet",2]
["Caldwell",3]
["Calhoun",4]
["Callahan",2]
["Cameron",4]
["Camp",2]
["Carson",1]
["Cass",2]
["Castro",1]
["Chambers",3]
["Cherokee",2]
["Childress",1]
["Clay",2]
["Cochran",1]
["Coke",2]
["Coleman",2]
["Collin",2]
["Collingsworth",1]
["Colorado",3]
["Comal",3]
["Comanche",2]
["Concho",2]
["Cooke",2]
["Coryell",2]
["Cottle",1]
["Crane",2]
["Crockett",2]
["Crosby",1]
["Culberson",2]
["Dallam",1]
["Dallas",2]
["Dawson",2]
["De Witt",3]
["Deaf Smith",1]
["Delta",2]
["Denton",2]
["Dickens",1]
["Dimmit",3]
["Donley",1]
["Duval",4]
["Eastland",2]
["Ector",2]
["Edwards",2]
["El Paso",5]
["Ellis",2]
["Erath",2]
["Falls",2]
["Fannin",2]
["Fayette",3]
["Fisher",2]
["Floyd",1]
["Foard",1]
["Fort Bend",3]
["Franklin",2]
["Freestone",2]
["Frio",3]
["Gaines",1]
["Galveston",3]
["Garza",1]
["Gillespie",2]
["Glasscock",2]
["Goliad",3]
["Gonzales",3]
["Gray",1]
["Grayson",2]
["Gregg",2]
["Grimes",3]
["Guadalupe",3]
["Hale",1]
["Hall",1]
["Hamilton",2]
["Hansford",1]
["Hardeman",1]
["Hardin",3]
["Harris",3]
["Harrison",2]
["Hartley",1]
["Haskell",2]
["Hays",2]
["Hemphill",1]
["Henderson",2]
["Hidalgo",4]
["Hill",2]
["Hockley",1]
["Hood",2]
["Hopkins",2]
["Houston",3]
["Howard",2]
["Hudspeth",5]
["Hunt",2]
["Hutchinson",1]
["Irion",2]
["Jack",2]
["Jackson",3]
["Jasper",2]
["Jeff Davis",2]
["Jefferson",3]
["Jim Hogg",4]
["Jim Wells",4]
["Johnson",2]
["Jones",2]
["Karnes",3]
["Kaufman",2]
["Kendall",2]
["Kenedy",4]
["Kent",1]
["Kerr",2]
["Kimble",2]
["King",1]
["Kinney",3]
["Kleberg",4]
["Knox",1]
["La Salle",3]
["Lamar",2]
["Lamb",1]
["Lampasas",2]
["Lavaca",3]
["Lee",3]
["Leon",2]
["Liberty",3]
["Limestone",2]
["Lipscomb",1]
["Live Oak",3]
["Llano",2]
["Loving",2]
["Lubbock",1]
["Lynn",1]
["Madison",2]
["Marion",2]
["Martin",2]
["Mason",2]
["Matagorda",3]
["Maverick",3]
["McCulloch",2]
["McLennan",2]
["McMullen",3]
["Medina",3]
["Menard",2]
["Midland",2]
["Milam",3]
["Mills",2]
["Mitchell",2]
["Montague",2]
["Montgomery",3]
["Moore",1]
["Morris",2]
["Motley",1]
["N/A"]
["Nacogdoches",2]
["Navarro",2]
["Newton",2]
["Nolan",2]
["Nueces",4]
["Ochiltree",1]
["Oldham",1]
["Orange",3]
["Palo Pinto",2]
["Panola",2]
["Parker",2]
["Parmer",1]
["Pecos",2]
["Polk",3]
["Potter",1]
["Presidio",2]
["Rains",2]
["Randall",1]
["Reagan",2]
["Real",2]
["Red River",2]
["Reeves",2]
["Refugio",4]
["Roberts",1]
["Robertson",2]
["Rockwall",2]
["Runnels",2]
["Rusk",2]
["Sabine",2]
["San Augustine",2]
["San Jacinto",3]
["San Patricio",4]
["San Saba",2]
["Schleicher",2]
["Scurry",2]
["Shackelford",2]
["Shelby",2]
["Sherman",1]
["Smith",2]
["Somervell",2]
["Starr",4]
["Stephens",2]
["Sterling",2]
["Stonewall",1]
["Sutton",2]
["Swisher",1]
["Tarrant",2]
["Taylor",2]
["Terrell",2]
["Terry",1]
["Throckmorton",2]
["Titus",2]
["Tom Green",2]
["Travis",2]
["Trinity",3]
["Tyler",3]
["Upshur",2]
["Upton",2]
["Uvalde",3]
["Val Verde",3]
["Van Zandt",2]
["Victoria",3]
["Walker",3]
["Waller",3]
["Ward",2]
["Washington",3]
["Webb",4]
["Wharton",3]
["Wheeler",1]
["Wichita",2]
["Wilbarger",1]
["Willacy",4]
["Williamson",2]
["Wilson",3]
["Winkler",2]
["Wise",2]
["Wood",2]
["Yoakum",1]
["Young",2]
["Zapata",4]
["Zavala",3]

{"sheet":"Utility Admin","index":13,"n_rows":53,"n_cols":16,"rows_kept":53,"cut":false,"hidden":true,"merged":[[2,4,3,4],[2,1,3,1],[2,2,3,2],[2,3,3,3],[2,11,3,11],[2,14,3,14],[2,15,3,15],[2,12,3,12],[2,13,3,13],[2,5,3,5],[2,6,3,6],[2,7,3,7],[2,8,3,8],[2,9,3,9],[2,10,3,10]]}
[]
[null,{"$f":"'Project Info'!I9","v":"AEP TCD"},{"$f":"'Project Info'!I10","v":"Commercial Solutions"},{"$f":"B2&C2","v":"AEP TCDCommercial Solutions"},{"$f":"IF('Project Info'!$I$9=\"\",0,INDEX(E5:E21,MATCH($D2,$D$5:$D$21,0),1))","v":0},{"$f":"IF('Project Info'!$I$9=\"\",0,INDEX(F5:F21,MATCH($D2,$D$5:$D$21,0),1))","v":0},{"$f":"IF('Project Info'!$I$9=\"\",0,IF(INDEX(G5:G21,MATCH($D2,$D$5:$D$21,0),1)=0,999999,INDEX(G5:G21,MATCH($D2,$D$5:$D$21,0),1)))","v":999999},{"$f":"IF('Project Info'!$I$9=\"\",0,INDEX(H5:H21,MATCH($D2,$D$5:$D$21,0),1))","v":"TX"},{"$f":"IF('Project Info'!$I$9=\"\",\"No\",INDEX(I5:I21,MATCH($D2,$D$5:$D$21,0),1))","v":"No"},{"$f":"IF('Project Info'!$I$9=\"\",0,INDEX(J5:J21,MATCH($D2,$D$5:$D$21,0),1))","v":0.02},{"$f":"IF('Project Info'!$I$9=\"\",0,INDEX(K5:K21,MATCH($D2,$D$5:$D$21,0),1))","v":7.4992000000000003E-2},{"$f":"IF('Project Info'!$I$9=\"\",0,INDEX(L5:L21,MATCH($D2,$D$5:$D$21,0),1))","v":80},{"$f":"IF('Project Info'!$I$9=\"\",0,INDEX(M5:M21,MATCH($D2,$D$5:$D$21,0),1))","v":0.11360000000000001},{"$f":"IF('Project Info'!$I$9=\"\",0,INDEX(N5:N21,MATCH($B2,$B$5:$B$21,0),1))","v":"TCC"},{"$f":"INDEX(O5:O21,MATCH($D2,$D$5:$D$21,0),1)","v":10},{"$f":"INDEX(P5:P21,MATCH($D2,$D$5:$D$21,0),1)","v":20}]
[null,"Utility","Program","UtilityProgram","Max base","Max %","Max incentive","TRM","Load Factor","Discount","Escalation","AC kW","AC kWh","Abbreviated for Name Mgr","$/Door Sweep","$/Weather Stripping"]
[]
[null,"AEP SWEPCO","Commercial Solutions",{"$f":"B5&C5","v":"AEP SWEPCOCommercial Solutions"},null,null,{"$f":"IF('Project Info'!$D$18=\"\",'Utility Admin'!E5,MIN(F5*'Project Info'!$D$18,E5))","v":0},"TX","No",0.02,7.1800000000000003E-2,80,0.11360000000000001,"SWEPCOTX",20,30]
[null,"AEP SWEPCO","SCORE",{"$f":"B6&C6","v":"AEP SWEPCOSCORE"},null,null,{"$f":"IF('Project Info'!$D$18=\"\",'Utility Admin'!E6,MIN(F6*'Project Info'!$D$18,E6))","v":0},"TX","No",0.02,7.1800000000000003E-2,80,0.11360000000000001,"SWEPCOTX",20,30]
[null,"AEP TCD","Commercial Solutions","AEP TCDCommercial Solutions",null,null,{"$f":"IF('Project Info'!$D$18=\"\",'Utility Admin'!E7,MIN(F7*'Project Info'!$D$18,E7))","v":0},"TX","No",0.02,7.4992000000000003E-2,80,0.11360000000000001,"TCC",10,20]
[null,"AEP TCD","SCORE/CitySmart","AEP TCDSCORE/CitySmart",null,null,{"$f":"IF('Project Info'!$D$18=\"\",'Utility Admin'!E8,MIN(F8*'Project Info'!$D$18,E8))","v":0},"TX","No",0.02,7.4992000000000003E-2,80,0.11360000000000001,"TCC",10,20]
[null,"AEP TND","Commercial Solutions","AEP TNDCommercial Solutions",null,null,{"$f":"IF('Project Info'!$D$18=\"\",'Utility Admin'!E9,MIN(F9*'Project Info'!$D$18,E9))","v":0},"TX","No",0.02,7.4579999999999994E-2,80,0.11360000000000001,"TNC",10,20]
[null,"AEP TND","SCORE/CitySmart","AEP TNDSCORE/CitySmart",null,null,{"$f":"IF('Project Info'!$D$18=\"\",'Utility Admin'!E10,MIN(F10*'Project Info'!$D$18,E10))","v":0},"TX","No",0.02,7.4579999999999994E-2,80,0.11360000000000001,"TNC",10,20]
[null,"CenterPoint Energy","SCORE/CitySmart","CenterPoint EnergySCORE/CitySmart",null,null,{"$f":"IF('Project Info'!$D$18=\"\",'Utility Admin'!E11,MIN(F11*'Project Info'!$D$18,E11))","v":0},"TX","No",0.02,8.2100000000000006E-2,80,0.11360000000000001,"CNP",{"$error":"#N/A"},{"$error":"#N/A"}]
[null,"CPS Energy","Large C&I","CPS EnergyLarge C&I",999999,0.75,{"$f":"IF('Project Info'!$D$18=\"\",'Utility Admin'!E12,MIN(F12*'Project Info'!$D$18,E12))","v":999999},"CPS","No",0.02,6.6000000000000003E-2,81.569999999999993,4.5199999999999997E-2,"CPS",10,20]
[null,"CPS Energy","Schools & Inst","CPS EnergySchools & Inst",999999,0.75,{"$f":"IF('Project Info'!$D$18=\"\",'Utility Admin'!E13,MIN(F13*'Project Info'!$D$18,E13))","v":999999},"CPS","No",0.02,6.6000000000000003E-2,81.569999999999993,4.5199999999999997E-2,"CPS",10,20]
[null,"CPS Energy","Small Business","CPS EnergySmall Business",999999,0.8,{"$f":"IF('Project Info'!$D$18=\"\",'Utility Admin'!E14,MIN(F14*'Project Info'!$D$18,E14))","v":999999},"CPS","No",0.02,6.6000000000000003E-2,81.569999999999993,4.5199999999999997E-2,"CPS",10,20]
[null,"El Paso Electric TX","Large Commercial Solutions","El Paso Electric TXLarge Commercial Solutions",null,null,{"$f":"IF('Project Info'!$D$18=\"\",'Utility Admin'!E15,MIN(F15*'Project Info'!$D$18,E15))","v":0},"TX","No",0.02,7.0250000000000007E-2,80,0.11360000000000001,"EPETX",{"$error":"#N/A"},{"$error":"#N/A"}]
[null,"El Paso Electric TX","SCORE","El Paso Electric TXSCORE",null,null,{"$f":"IF('Project Info'!$D$18=\"\",'Utility Admin'!E16,MIN(F16*'Project Info'!$D$18,E16))","v":0},"TX","No",0.02,7.0250000000000007E-2,80,0.11360000000000001,"EPETX",{"$error":"#N/A"},{"$error":"#N/A"}]
[null,"El Paso Electric TX","Small Commercial Solutions","El Paso Electric TXSmall Commercial Solutions",null,null,{"$f":"IF('Project Info'!$D$18=\"\",'Utility Admin'!E17,MIN(F17*'Project Info'!$D$18,E17))","v":0},"TX","No",0.02,7.0250000000000007E-2,80,0.11360000000000001,"EPETX",{"$error":"#N/A"},{"$error":"#N/A"}]
[null,"Entergy TX","Commercial Solutions","Entergy TXCommercial Solutions",null,null,{"$f":"IF('Project Info'!$D$18=\"\",'Utility Admin'!E18,MIN(F18*'Project Info'!$D$18,E18))","v":0},"TX","No",0.02,7.7252799999999996E-2,80,0.11360000000000001,"ETI",{"$error":"#N/A"},{"$error":"#N/A"}]
[null,"Texas-New Mexico Power","Commercial Solutions","Texas-New Mexico PowerCommercial Solutions",null,null,{"$f":"IF('Project Info'!$D$18=\"\",'Utility Admin'!E19,MIN(F19*'Project Info'!$D$18,E19))","v":0},"TX",5256,0.02,7.8899999999999998E-2,80,0.11360000000000001,"TNMP",{"$error":"#N/A"},{"$error":"#N/A"}]
[null,"Texas-New Mexico Power","SCORE/CitySmart","Texas-New Mexico PowerSCORE/CitySmart",null,null,{"$f":"IF('Project Info'!$D$18=\"\",'Utility Admin'!E20,MIN(F20*'Project Info'!$D$18,E20))","v":0},"TX",5256,0.02,7.8899999999999998E-2,80,0.11360000000000001,"TNMP",{"$error":"#N/A"},{"$error":"#N/A"}]
[null,"Texas-New Mexico Power","SCORE Underserved/Small Score","Texas-New Mexico PowerSCORE Underserved/Small Score",null,null,{"$f":"IF('Project Info'!$D$18=\"\",'Utility Admin'!E21,MIN(F21*'Project Info'!$D$18,E21))","v":0},"TX",5256,0.02,7.8899999999999998E-2,80,0.11360000000000001,"TNMP",{"$error":"#N/A"},{"$error":"#N/A"}]
[]
[null,"TX"]
[null,"AEP TCD"]
[null,"AEP TND"]
[null,"CenterPoint Energy"]
[null,"CPS Energy"]
[null,"El Paso Electric TX"]
[null,"Entergy TX"]
[null,"Texas-New Mexico Power"]
[]
[]
[]
[]
[]
[]
[]
[]
[]
[]
[]
[]
[]
[]
[]
[]
[]
[]
["DO NOT MOVE"]
["<- this should be row 50","Account #:","PPI:"]
[null,"Name on Account or Tax ID:"]
[null,"PPI Hide Trigger:"]
[null,null,true]

{"sheet":"Version Log","index":14,"n_rows":157,"n_cols":7,"rows_kept":157,"cut":false,"hidden":true,"merged":[[1,1,1,5],[3,5,3,6],[4,2,4,3],[4,5,4,6]]}
[]
[null,"Version Log"]
[]
[null,"Original Author:","A. Boone Drummond / A Keeling",null,"QA/QC Engineer(s):","A. Boone Drummond"]
[null,"Primary Developer:","Adam Groenhuyzen",null,"Senior Engineer Approval:"]
[]
[null,"Program Year","Version","Date","Reason for Change/Measure Changed","Change Description","Contact, Department"]
[null,2016,null,"2015-11-16","High Efficiency Electric Convection Oven","TRM v3.1 Deemed Table and calculator interface","A Boone Drummond"]
[null,2016,null,"2015-11-16","High Efficiency Electric Combination Oven","TRM v3.1 Deemed Table and calculator interface","A Boone Drummond"]
[null,2016,null,"2015-11-16","ENERGY STAR Commercial Dishwashers","TRM v3.1 Deemed Table and calculator interface","A Boone Drummond"]
[null,2016,null,"2015-11-16","ENERGY STAR Electric Steam Cookers","TRM v3.1 Deemed Table and calculator interface","A Boone Drummond"]
[null,2016,null,"2015-11-16","ENERGY STAR Commercial Electric Hot Food Holding Cabinet","TRM v3.1 Deemed Table and calculator interface","A Boone Drummond"]
[null,2016,null,"2015-11-16","ENERGY STAR Electric Fryer","TRM v3.1 Deemed Table and calculator interface","A Boone Drummond"]
[null,2016,null,"2015-11-16","Guestroom, Dormitory and Multifamily Occupancy Control (NC & Retro)","TRM v3.1 Deemed Table, removed Multi Family, and calculator interface","A Boone Drummond"]
[null,2016,null,"2015-11-16","Variable Frequency Drive (VFD) on Air Handler Unit (AHU) Supply Fan","TRM v3.1 Deemed Table and calculator interface","A Boone Drummond"]
[null,2016,null,"2015-11-23","Lodging Occupancy Sensor Controls","Changed name","Adam Keeling"]
[null,2016,null,"2015-11-23","Lodging Occupancy Sensor Controls","Simplified sheet","Adam Keeling"]
[null,2016,null,"2015-11-23","Lodging Occupancy Sensor Controls","Changed lookups to index/match","Adam Keeling"]
[null,2016,null,"2015-11-23","Combination Oven","Changed from \"high efficiency\" to \"ENERGY STAR\"","Adam Keeling"]
[null,2016,null,"2015-11-23","Food Service","Removed building type selection","Adam Keeling"]
[null,2016,null,"2015-11-23","Dishwasher","Changed lookups to index/match","Adam Keeling"]
[null,2016,null,"2015-11-23","Fryers","Fixed savings to multiply by quantity","Adam Keeling"]
[null,2016,null,"2015-11-23","Holding cabinet","Fixed savings to multiply by quantity","Adam Keeling"]
[null,2016,null,"2015-11-23","Holding cabinet","Changed formulas to lookups","Adam Keeling"]
[null,2016,null,"2015-11-23","Food Service","Simplified sheet","Adam Keeling"]
[null,{"$f":"IF(D26=\"\",\"\",YEAR(D26))","v":""},null,null,"VFD","Simplified sheet"]
[null,2017,null,"2016-11-09","VFD on AHU","Added CPS compatability","Adam Groenhuyzen"]
[null,2017,null,"2016-11-10","ECM on Evaporator Fan","Updated measure for TRM4 methodology","Adam Groenhuyzen"]
[null,2017,null,"2016-11-10","workbook","added Macros to reconfigure workbook for CPS & NCP kW","Adam Groenhuyzen"]
[null,2017,null,"2016-11-10","Pre Rinse Spray Valves","Added CPS compatability","Adam Groenhuyzen"]
[null,2017,null,"2016-11-10","General Formatting","Improved overall formatting/color schemes","Adam Groenhuyzen"]
[null,2017,null,"2016-11-11","Refrigeration measures","Updated all remaining measures to TRM 4.0 and added CPS compatibility","Adam Groenhuyzen"]
[null,2017,null,"2016-11-15","Window Film, POC","added measures","Adam Groenhuyzen"]
[null,2017,null,"2016-11-28",null,"Remove EUL summary","Adam Keeling"]
[null,2017,null,null,null,"Replaced zone input on each sheet with county input on ProjectInfo"]
[null,2017,null,null,null,"Replaced \"kW\" with \"Peak kW\""]
[null,2017,null,null,null,"added more rows to ensure each measure has at least 3"]
[null,2017,null,null,null,"added Utility and Program inputs"]
[null,2017,null,null,"ECM on Evaporator Fan","Split input of Walk-in vs Case and refrigeration temp"]
[null,2017,null,null,null,"changed all refrigerator types to temps for consistency"]
[null,2017,null,null,null,"formatting clean up"]
[null,2017,null,null,"Reach-ins","added quantity"]
[null,2017,null,null,"Zero energy doors","fixed lookups"]
[null,2017,null,null,"Electronic Defrost Controls","updated kW/ton values"]
[null,2017,null,null,"Vending machine controls","removed CF for CPS"]
[null,2017,null,null,null,"increased decimal places to 3 for all kW"]
[null,2017,null,null,"all food service except PRSV","set NCP=CP kW since not in guidebook"]
[null,2017,null,null,"convection oven","fixed lookups"]
[null,2017,null,null,"Combination Oven","fixed lookups"]
[null,2017,null,null,"Fryers","fixed lookups"]
[null,2017,null,null,"Dishwasher","added type definitions from TRM"]
[null,2017,null,null,"window treatment","made CPS same as Zone 3"]
[null,2017,null,null,"Lodging Occupancy Sensor Controls","made CPS same as Zone 3"]
[null,2017,null,null,null,"changed button macros to be automatic based on Utility selection"]
[null,2017,null,null,null,"alphabetized order of refrigeration measures"]
[null,2017,null,null,null,"added CPS small business"]
[null,2017,null,null,"door gaskets","added for CPS only"]
[null,2017,null,null,null,"added incentives for all"]
[null,2017,null,null,"gaskets","changed to height, width entry"]
[null,2017,null,null,"ECM on Evaporator Fan","added existing motor type"]
[null,2017,null,null,"aerators","added for CPS only"]
[null,2017,null,null,"showerheads","added for CPS only"]
[null,2017,null,null,"window treatment","changed post shading type to post shading coefficient"]
[null,2017,null,"2016-12-16",null,"removed some unnecessary data validation in unused cells"]
[null,2017,null,null,null,"added iferror statements to incentive fields"]
[null,2017,null,null,null,"fixed some lost data validation"]
[null,2017,null,null,null,"Auto-populate county to Bexar if CPS"]
[null,2017,null,null,null,"separated project info into required and optional"]
[null,2017,null,null,null,"moved county and project cost up to required section"]
[null,2017,null,"2017-03-16","utility admin","updated entergytx refrig incentive","Adam Groenhuyzen"]
[null,2017,null,null,null,"fixed incentive cap calc to not be $0 when utility doesn't have a cap"]
[null,2017,null,"2017-04-05","utility admin","corrected CPS incentives for HVAC controls"]
[null,2017,null,"2017-05-10","Food Service","incorporated LA/MS & CPS 2017 Guidebook changes"]
[null,2017,"V17.1.2","2017-05-10","workbook","added macros to show/hide measure tabs, and macros to show/hide individual measures on refrigeration & commercial kitchen"]
[null,2017,null,null,"Refrigeration measures","added load factor for TNMP"]
[null,2017,null,null,"Lodging Occupancy Sensor Controls","Added load factor, updated for CPS 2017 Guidebook"]
[null,2017,null,null,"VFD on AHU","Added LA/MS, load factor"]
[null,2018,null,"2017-10-05","Evap Pre-Cool & Pool Pump","Added measures as per TX TRM 5"]
[null,2018,null,"2017-10-16","Refrigeration measures, Commercial Kitchen","Added LA/MS. Configured multiple measures which require different inputs to show/hide necessary input fields as per selected TRM."]
[null,2018,null,null,"workbook","various bug fixes"]
[null,2018,"V18.0.0","2017-10-17","VFD on AHU","Added CV systems for CPS & updated savings tables for Nov 2017 Guidebook"]
[null,2018,null,"2017-11-20","Savings Summary","Added kWh-weighted capped incentive column"]
[null,2018,null,null,"VFD on AHU","Updated TX tables for TRM 5"]
[null,2018,null,null,"workbook","changed Load Factor from being applied at every measure to only be applied on Savings Summary sheet"]
[null,2018,null,null,"Updated for next program year",null,"Adam Groenhuyzen"]
[null,2018,null,"2018-01-08","QA/QC",null,"A Boone Drummond"]
[null,2018,null,"2018-01-09","Lookup tables","updated values. ","Adam Groenhuyzen"]
[null,2018,null,"2018-01-11","workbook","updates & bug fixes","Adam Groenhuyzen"]
[null,2018,null,"2018-01-16","utility admin","updated TX incentive rates. Locked tool to TX only for now.","Adam Groenhuyzen"]
[null,2018,null,"2018-01-17","utility admin","updated TX load factor for CNP & ETI","Adam Groenhuyzen"]
[null,2018,"v18.0.1","2018-01-30","foodservice","changed incentives for pre-rinse spray valves, low flow showerheads, and low flow faucets to be savings based.","Adam Groenhuyzen"]
[null,2018,"v18.0.2","2018-07-20","Summary","Corrected how load factor is applied, removed incentives from measure sheets.","Adam Groenhuyzen"]
[null,2018,"v18.1.0","2018-08-24","Project Info","Added Hide/Restore PPI macros","Adam Groenhuyzen"]
[null,2019,"v19.0.0","2018-10-01","Roofing","Added EnergyStar Roofing measure for TX TRM 6","Adam Groenhuyzen"]
[null,null,null,null,"workbook","Re-formatted all single-measure tabs to use same heading color, was running out of different heading colors","Adam Groenhuyzen"]
[null,null,null,null,"Door Gaskets","added compatibility for TX TRM 6","Adam Groenhuyzen"]
[null,null,null,null,"Door infiltration","Added new measure for TX TRM 6","Adam Groenhuyzen"]
[null,null,null,"2018-10-02","Macros","re-worked show/hide macros to simplify and condense code","Adam Groenhuyzen"]
[null,null,null,null,"Summary","Re-vamped worksheet","Adam Groenhuyzen"]
[null,null,null,null,"Project Info","Added title heading","Adam Groenhuyzen"]
[null,null,null,null,"Smart Thermostats","Added new measure for TX TRM 6","Adam Groenhuyzen"]
[null,null,"19.0.1","2019-01-24","Roofing","Updated lookup values & added eligibility check","Adam Groenhuyzen"]
[null,null,"19.0.2","2019-04-26","utility admin","Removed Load Factor for ETI","Adam Groenhuyzen"]
[null,2020,"20.0.0",null,"utility admin","Removed LA/MS/OK/AR","Adam Groenhuyzen"]
[null,null,null,null,"Food Service","Added Kitchen DCV, Commercial Ice Maker","Adam Groenhuyzen"]
[null,null,null,null,"HVAC","Consolidated HVAC measures, added HVLS fans","Adam Groenhuyzen"]
[null,null,null,null,"Motors","Consolidated motor measures, added premium eff motors","Adam Groenhuyzen"]
[null,null,null,null,"Misc","Consolidated misc measures, added PC power management & DHW Control","Adam Groenhuyzen"]
[null,null,null,"2019-12-02","QA/QC","QA/QC","Boone Drummond"]
[null,null,null,"2020-01-08","utility admin","Updated program incentives for 2020","Adam Groenhuyzen"]
[null,null,"20.0.1","2020-01-27","utility admin","Corrected ETI incentive rate. Updated workbook passwords to new ones.","Adam Groenhuyzen"]
[null,null,"20.1.0","2020-04-28","CPS TRM updates","Updated new measures for 2020 CPS Guidebook. Made reset workbook macro more robust. Added rounding to savings summary. Minor bug fixes.","Adam Groenhuyzen"]
[null,2021,"21.0","Nov 2020","TX TRM 8 Updates","HVAC VFD - added \"Other\" building type"]
[null,null,null,null,null,"Window Film - Updated SGHC, existing window type, HVAC type"]
[null,null,null,null,null,"Door air infiltration - updated deemed savings"]
[null,null,null,null,null,"PCPM - updated deemed savings"]
[null,null,null,null,null,"Pool Pump - updated deemed savings"]
[null,null,null,null,null,"Combination Oven - updated deemed savings"]
[null,null,null,null,null,"Zero Energy Doors - updated deemed savings"]
[null,null,null,null,null,"Vending machine controls - updated deemed savings"]
[null,null,null,null,null,"Dishwashers - changed EUL in summary table from 11 to 10"]
[null,null,null,null,null,"Pre rinse Spray Valve - added algorithm approach, removed deemed savings"]
[null,null,null,null,null,"Solid/glass door reach in - updated deemed savings"]
[null,null,null,null,null,"Prem Eff Motors - updated 250+HP efficiency tables"]
[null,null,null,null,null,"Low Flow Faucet Aerators & showerheads - moved to Misc"]
[null,null,null,null,null,"Temp Sensitive Restrictor Showerhead Valve - Added measure"]
[null,null,null,null,null,"EVSE - added measure"]
[null,null,null,null,null,"Vacuum Sealing & Packaging - added measure"]
[null,null,null,null,null,"High Speed Doors - added measure"]
[null,null,null,null,null,"ECM or VFD for CRAH - added measure"]
[null,null,"21.0.1","Jan 2021",null,"Changed incentives for door air infiltration for CPS to a fixed amount per foot.","Adam Groenhuyzen"]
[null,null,21.1,"June 2021","Bug Fixes","Window Treatment - Fixed drop down list for existing window type, updated eligibility criteria to remove \"must be single pane\""]
[null,null,null,null,null,"LED Traffic Signals - added measure"]
[null,null,null,null,null,"EnergyStar Roofing - changed measure name (no more ES QPL), revised r-value dropdowns for clarification; updated savings values for CPS"]
[null,null,null,null,null,"Added data validation input messages in several places"]
[null,null,null,"2021-09-01",null,"Fixed incentive lookup for HVAC VFD"]
[null,2022,"22.0","2021-10-26","PY2022 updates","Moved incentives from Utility Admin to Savings Summary for easier lookup"]
[null,null,null,null,null,"Added new measures: hydraulic oils, VFD water pumps, steam trap repair"]
[null,null,null,null,null,"Changed HVAC to include Envelope, changed Food Service to include DHW, moved associated measures out of Misc"]
[null,null,null,null,null,"Updated measures for TX TRM 9: HVAC VFD, Window Treamtent, Comb Oven, Conv Oven, Comm Dishwasher, Hot Food Hold Cab, Elec Fryer, Elec Steam Cooker, Comm Icemaker, Kitchen DCV, PreRinse Spray Valve, Door Heater Ctrl, ECM Evap Fan Mtr, Night Cover, Strip Curtain, Door Gasket, ES Pool Pump, PCPM"]
[null,null,null,null,null,"Removed CNP load factor"]
[null,null,null,"2022-01-05",null,"Released version 22.0 without DSMT export functionality, feature was unfinished and will be made available in a future version.","Adam Groenhuyzen"]
[null,null,null,"2022-02-25",null,"Updated EPE PAF year","Adam Groenhuyzen"]
[null,null,22.1,"2022-03-21",null,"Added type picklist to E&E door air infil","Adam Groenhuyzen"]
[null,null,null,null,null,"Changed window treatment total demand savings algorithm to MAX","Adam Groenhuyzen"]
[null,null,null,null,null,"Updated CNP incentives, added Air Infiltration per-door incentives for some utilities, revamped Air Infiltration measure inputs","Adam Groenhuyzen"]
[null,null,null,null,null,"Fixed bugs in a couple of measures"]
[null,null,null,null,null,"Added rounding to all measure-level savings calculations"]
[null,null,null,null,null,"Added incentive calculation for all measure line-items"]
[null,null,"23.0","2022-11-28",null,"Fixes to various measures, DSMT export engine"]
[null,null,null,null,"Smart Thermostats","Updated smart thermostat measure"]
[null,null,null,null,"Hand Dryers","added Hand Dryers measure"]
[null,null,null,null,"HVAC VFDs","removed motor size picklist on HVAC VFDs measure."]
[null,null,null,"2022-12-12",null,"Added AEP TND UAT measure IDs"]
[null,null,null,null,"Combination Oven","Updated pan capacity and savings for TX TRM 10"]
[null,null,null,null,"convection oven","Updated savings for TX TRM10"]
[null,null,null,null,"Pool Pumps","Updated picklist to go to 5HP for TX TRM 10"]